{"text_format":"1","workbook":"xlsx","n_sheets":13,"sheets":["Instructions","Project Info","EPE PAF","Savings Summary","Refrigeration","Food Service","HVAC","Motors","Misc","Lookup tables","County to Zone","Utility Admin","Version Log"],"not_rendered":{"charts":0,"images":12,"macros":1,"external_links":0,"defined_names":138,"comments":0,"pivot_tables":0},"unopened":[],"bounds":{"document_bytes":16777216,"sheet_cells":100000,"rows_first":2000,"rows_last":500,"rows_between":2000,"halvings":0,"cell_chars":16384,"cell_head_chars":4096},"cells_cut":0,"cells_raw":0,"read":"whole","date_system":"1900"}

{"sheet":"Instructions","index":0,"n_rows":39,"n_cols":2,"rows_kept":39,"cut":false,"hidden":true,"merged":[[26,1,27,12],[34,1,35,13],[38,0,40,13],[1,0,2,12]]}
["Instructions"]
["This sheet provides basic instructions for using this calculator. Please contact the utility rebate program staff for further help or questions."]
[]
[]
["Getting Started"]
[]
{"$rows_left_out":34}
{"sheet":"Project Info","index":1,"n_rows":20,"n_cols":13,"rows_kept":20,"cut":false,"hidden":false,"merged":[[17,3,17,4],[19,3,19,10],[12,3,12,5],[12,9,12,10],[3,3,3,10],[4,3,4,10],[5,3,5,10],[6,3,6,10],[8,3,8,4],[8,8,8,9],[9,3,9,4],[9,8,9,9],[10,3,10,10],[11,3,11,4],[11,8,11,10],[1,1,1,6],[0,12,0,15],[13,3,13,10],[14,3,14,8],[16,3,16,4]]}
[null,"South \"Other Measures\" Calculator",null,null,null,null,null,null,null,null,"v20.0"]
[null,"A calculation tool for determining deemed savings for projects other than standard prescriptive lighting & HVAC replacements."]
[null,null,null,null,null,{"$f":"IF(OR(D9=\"\",D10=\"\",I9=\"\",I10=\"\"),\"Please fill in highlighted cells to continue.\",\"\")","v":"Please fill in highlighted cells to continue."},null,null,null,null,null,null,"Click buttons to open or close measures"]
[null,null,"Assessed by:"]
[null,null,"Project ID:"]
[null,null,"Project Name:"]
{"$rows_left_out":15}
{"sheet":"EPE PAF","index":2,"n_rows":26,"n_cols":20,"rows_kept":26,"cut":false,"hidden":true,"merged":[[10,3,10,6],[10,9,10,16],[1,3,1,14],[2,3,2,14],[3,3,3,14],[4,5,4,12],[7,3,7,16],[8,3,8,6],[8,9,8,16],[9,3,9,5],[9,9,9,16],[11,3,11,16],[12,3,12,6],[12,9,12,11],[12,14,12,16],[14,2,14,5],[14,6,14,10],[14,11,14,15],[18,1,18,16],[24,14,24,16],[15,2,15,5],[15,6,15,10],[15,11,15,15],[24,4,24,11],[20,4,20,7],[25,1,25,16],[22,8,23,9],[19,14,19,16],[19,4,19,12],[20,11,20,16]]}
[]
[null,null,null,"EL PASO ELECTRIC",null,null,null,null,null,null,null,null,null,null,null,"",null,null,null,""]
[null,null,null,"SMALL COMMERCIAL SOLUTIONS PROGRAM"]
[null,null,null,"2020 PAYMENT REQUEST FOR MEASURES:"]
[null,null,null,null,null,{"$f":"'Savings Summary'!Q42","v":{"$error":"#VALUE!"}}]
[]
{"$rows_left_out":21}
{"sheet":"Savings Summary","index":3,"n_rows":46,"n_cols":17,"rows_kept":46,"cut":false,"hidden":false,"merged":[[45,7,47,9],[7,1,16,1],[6,1,6,2],[17,1,27,1],[28,1,32,1],[33,1,35,1],[36,1,40,1]]}
[null,"Savings Summary",null,null,null,null,null,null,null,null,"HIDE","HIDE","HIDE","HIDE","HIDE","HIDE","HIDE"]
[null,null,"Project Name:",{"$f":"IF('Project Info'!D6:K6=\"\",\"\",'Project Info'!D6:K6)","v":""}]
[]
[null,null,null,null,"Total Summer Peak kW Savings","Total Winter Peak kW Savings","Total Non-Coincident kW Savings","Total kWh Savings","Total Incentive*","Total Project Cost","Non-Capped Incentive"]
[null,null,null,null,{"$f":"SUM(E8:E41)","v":0},{"$f":"SUM(F8:F41)","v":0},{"$f":"SUM(G8:G41)","v":0},{"$f":"SUM(H8:H41)","v":0},{"$f":"IF(I43=\"Yes\",'Utility Admin'!I2,K5)","v":0},{"$f":"IF('Project Info'!D18=\"\",\"Not Entered\",'Project Info'!D18)","v":"Not Entered"},{"$f":"SUM(K8:K41)","v":0}]
[]
{"$rows_left_out":41}
{"sheet":"Refrigeration","index":4,"n_rows":75,"n_cols":21,"rows_kept":75,"cut":false,"hidden":true,"merged":[[11,6,14,6],[26,4,26,8],[28,7,29,8],[42,7,47,8]]}
[null,"Refrigeration Measures",null,null,null,null,null,null,null,null,"HIDE","HIDE","HIDE","HIDE","HIDE","HIDE","HIDE","HIDE","HIDE","HIDE","HIDE"]
[null,"Click on headings to expand or collapse sections. Blue Peak kW values indicate winter peak."]
[null,"Door Gaskets"]
[null,"Peak kW","NC kW","kWh","Quantity of Doors","Height (inches)","Width (inches)","Number of Sides","Refrigeration Temperature"]
[null,{"$f":"E5*(2*F5+IF(H5=3,1,IF(H5=4,2,0))*G5)/12*IFERROR(INDEX('Lookup tables'!$G$3:$H$4,MATCH(Refrigeration!I5,'Lookup tables'!$D$3:$D$4,0),MATCH('Utility Admin'!$J$2,'Lookup tables'!$E$1:$F$1,0)),0)","v":0},{"$f":"E5*(2*F5+IF(H5=3,1,IF(H5=4,2,0))*G5)/12*IFERROR(INDEX('Lookup tables'!$I$3:$J$4,MATCH(Refrigeration!I5,'Lookup tables'!$D$3:$D$4,0),MATCH('Utility Admin'!$J$2,'Lookup tables'!$E$1:$F$1,0)),0)","v":0},{"$f":"IFERROR(E5*(2*F5+IF(H5=3,1,IF(H5=4,2,0))*G5)/12*INDEX('Lookup tables'!$E$3:$F$4,MATCH(Refrigeration!I5,'Lookup tables'!$D$3:$D$4,0),MATCH('Utility Admin'!$J$2,'Lookup tables'!$E$1:$F$1,0)),0)","v":0}]
[null,{"$f":"E6*(2*F6+IF(H6=3,1,IF(H6=4,2,0))*G6)/12*IFERROR(INDEX('Lookup tables'!$G$3:$H$4,MATCH(Refrigeration!I6,'Lookup tables'!$D$3:$D$4,0),MATCH('Utility Admin'!$J$2,'Lookup tables'!$E$1:$F$1,0)),0)","v":0},{"$f":"E6*(2*F6+IF(H6=3,1,IF(H6=4,2,0))*G6)/12*IFERROR(INDEX('Lookup tables'!$I$3:$J$4,MATCH(Refrigeration!I6,'Lookup tables'!$D$3:$D$4,0),MATCH('Utility Admin'!$J$2,'Lookup tables'!$E$1:$F$1,0)),0)","v":0},{"$f":"IFERROR(E6*(2*F6+IF(H6=3,1,IF(H6=4,2,0))*G6)/12*INDEX('Lookup tables'!$E$3:$F$4,MATCH(Refrigeration!I6,'Lookup tables'!$D$3:$D$4,0),MATCH('Utility Admin'!$J$2,'Lookup tables'!$E$1:$F$1,0)),0)","v":0}]
{"$rows_left_out":70}
{"sheet":"Food Service","index":5,"n_rows":83,"n_cols":23,"rows_kept":83,"cut":false,"hidden":true,"merged":[[73,2,73,9],[74,2,75,9],[76,2,77,9],[78,2,79,9],[80,2,81,9],[76,1,77,1],[74,1,75,1],[80,1,81,1],[78,1,79,1],[82,2,82,9],[64,12,65,12],[64,13,65,13],[64,14,65,14],[15,6,15,7],[16,6,16,7],[17,6,17,7],[18,6,18,7],[45,6,45,7],[46,6,46,7],[47,6,47,7],[48,6,48,7],[51,6,51,7],[52,6,52,7],[53,6,53,7],[54,6,54,7]]}
[null,"Commercial Food Service Measures",null,null,null,null,null,null,null,null,null,null,"HIDE","HIDE","HIDE","HIDE","HIDE","HIDE","HIDE","HIDE","HIDE","HIDE","HIDE"]
[null,"Click on headings to expand or collapse sections. Blue Peak kW values indicate winter peak."]
[null,"ENERGY STAR Electric Convection Oven"]
[null,"Peak kW","NC kW","kWh","Number of Ovens","Oven Size"]
[null,{"$f":"IFERROR(VLOOKUP(F5,'Lookup tables'!$D$115:$K$116,3,FALSE)*E5,0)","v":0},{"$f":"IFERROR(VLOOKUP(F5,'Lookup tables'!$D$115:$K$116,4,FALSE)*E5,0)","v":0},{"$f":"IFERROR(VLOOKUP(F5,'Lookup tables'!$D$115:$K$116,2,FALSE)*E5,0)","v":0}]
[null,{"$f":"IFERROR(VLOOKUP(F6,'Lookup tables'!$D$115:$K$116,3,FALSE)*E6,0)","v":0},{"$f":"IFERROR(VLOOKUP(F6,'Lookup tables'!$D$115:$K$116,4,FALSE)*E6,0)","v":0},{"$f":"IFERROR(VLOOKUP(F6,'Lookup tables'!$D$115:$K$116,2,FALSE)*E6,0)","v":0}]
{"$rows_left_out":78}
{"sheet":"HVAC","index":6,"n_rows":41,"n_cols":21,"rows_kept":41,"cut":false,"hidden":true,"merged":[[29,13,30,13],[29,15,30,15],[34,7,34,9],[14,5,14,6],[22,7,22,9],[29,12,30,12]]}
[null,"HVAC Measures",null,null,null,null,null,null,null,null,null,"HIDE","HIDE","HIDE","HIDE","HIDE","HIDE","HIDE","HIDE","HIDE","HIDE"]
[null,"Click on headings to expand or collapse sections. Blue Peak kW values indicate winter peak."]
[null,"HVAC Variable Frequency Drives (VFD's)"]
[null,"Peak kW","NCP kW","kWh","Quantity","Application","Building Type","Motor Size (HP)","Existing Control Type\n(AHU Supply Fans Only)",null,null,"kWh/HP","kW/HP Summer","kW/HP Winter"]
[null,{"$f":"E5*H5*MAX(M5,N5)","v":0},{"$f":"B5","v":0},{"$f":"E5*H5*L5","v":0},null,null,null,null,null,null,null,{"$f":"IFERROR(INDEX(VFDSavingsTable,MATCH(1,(State&SelectedZone='Lookup tables'!$D$265:$D$300)*(HVAC!F5='Lookup tables'!$E$265:$E$300)*(HVAC!I5='Lookup tables'!$F$265:$F$300),0),MATCH(1,(HVAC!G5='Lookup tables'!$G$263:$V$263)*(\"kWh\"='Lookup tables'!$G$264:$V$264),0)),0)","v":0},{"$f":"IF(F5=\"Hot Water Pump\",0,IFERROR(INDEX(VFDSavingsTable,MATCH(1,(State&SelectedZone='Lookup tables'!$D$265:$D$300)*(HVAC!F5='Lookup tables'!$E$265:$E$300)*(HVAC!I5='Lookup tables'!$F$265:$F$300),0),MATCH(1,(HVAC!G5='Lookup tables'!$G$263:$V$263)*(\"kW\"='Lookup tables'!$G$264:$V$264),0)),0))","v":0},{"$f":"IF(F5=\"Hot Water Pump\",IFERROR(INDEX(VFDSavingsTable,MATCH(1,(State&SelectedZone='Lookup tables'!$D$265:$D$300)*(HVAC!F5='Lookup tables'!$E$265:$E$300)*(HVAC!I5='Lookup tables'!$F$265:$F$300),0),MATCH(1,(HVAC!G5='Lookup tables'!$G$263:$V$263)*(\"kW\"='Lookup tables'!$G$264:$V$264),0)),0),0)","v":0}]
[null,0,{"$f":"B6","v":0},{"$f":"E6*H6*L6","v":0},null,null,null,null,null,null,null,{"$f":"IFERROR(INDEX(VFDSavingsTable,MATCH(1,(State&SelectedZone='Lookup tables'!$D$265:$D$300)*(HVAC!F6='Lookup tables'!$E$265:$E$300)*(HVAC!I6='Lookup tables'!$F$265:$F$300),0),MATCH(1,(HVAC!G6='Lookup tables'!$G$263:$V$263)*(\"kWh\"='Lookup tables'!$G$264:$V$264),0)),0)","v":0},{"$f":"IF(F6=\"Hot Water Pump\",0,IFERROR(INDEX(VFDSavingsTable,MATCH(1,(State&SelectedZone='Lookup tables'!$D$265:$D$300)*(HVAC!F6='Lookup tables'!$E$265:$E$300)*(HVAC!I6='Lookup tables'!$F$265:$F$300),0),MATCH(1,(HVAC!G6='Lookup tables'!$G$263:$V$263)*(\"kW\"='Lookup tables'!$G$264:$V$264),0)),0))","v":0},{"$f":"IF(F6=\"Hot Water Pump\",IFERROR(INDEX(VFDSavingsTable,MATCH(1,(State&SelectedZone='Lookup tables'!$D$265:$D$300)*(HVAC!F6='Lookup tables'!$E$265:$E$300)*(HVAC!I6='Lookup tables'!$F$265:$F$300),0),MATCH(1,(HVAC!G6='Lookup tables'!$G$263:$V$263)*(\"kW\"='Lookup tables'!$G$264:$V$264),0)),0),0)","v":0}]
{"$rows_left_out":36}
{"sheet":"Motors","index":7,"n_rows":22,"n_cols":34,"rows_kept":22,"cut":false,"hidden":true,"merged":[[16,20,17,20],[16,12,17,12],[16,13,17,13],[16,14,17,14],[16,21,17,21],[16,15,17,15],[16,16,17,16],[16,17,17,17],[16,18,17,18],[16,19,17,19]]}
[null,"Motor Measures",null,null,null,null,null,null,null,null,null,null,"HIDE","HIDE","HIDE","HIDE","HIDE","HIDE","HIDE","HIDE","HIDE","HIDE","HIDE","HIDE","HIDE","HIDE","HIDE","HIDE","HIDE","HIDE","HIDE","HIDE","HIDE","HIDE"]
[null,"Click on headings to expand or collapse sections. Blue Peak kW values indicate winter peak."]
[null,"ENERGY STAR Commercial Pool Pumps"]
[null,"Peak kW","NCP kW","kWh","Pump Quantity","Rated Pump hp (New)","Pool Operation",null,null,null,null,null,"kWh savings","kW savings"]
[null,{"$f":"IFERROR(N5,0)","v":0},{"$f":"IFERROR(N5,0)","v":0},{"$f":"IFERROR(M5,0)","v":0},null,null,null,null,null,null,null,null,{"$f":"INDEX('Lookup tables'!$E$401:$G$405,MATCH(F5,'Lookup tables'!$D$401:$D$405,0),MATCH(G5,'Lookup tables'!$E$400:$G$400,0))*E5","v":{"$error":"#N/A"}},{"$f":"INDEX('Lookup tables'!$H$401:$H$405,MATCH(F5,'Lookup tables'!$D$401:$D$405,0))*E5","v":{"$error":"#N/A"}}]
[null,{"$f":"IFERROR(N6,0)","v":0},{"$f":"IFERROR(N6,0)","v":0},{"$f":"IFERROR(M6,0)","v":0},null,null,null,null,null,null,null,null,{"$f":"INDEX('Lookup tables'!$E$401:$G$405,MATCH(F6,'Lookup tables'!$D$401:$D$405,0),MATCH(G6,'Lookup tables'!$E$400:$G$400,0))*E6","v":{"$error":"#N/A"}},{"$f":"INDEX('Lookup tables'!$H$401:$H$405,MATCH(F6,'Lookup tables'!$D$401:$D$405,0))*E6","v":{"$error":"#N/A"}}]
{"$rows_left_out":17}
{"sheet":"Misc","index":8,"n_rows":34,"n_cols":21,"rows_kept":34,"cut":false,"hidden":true,"merged":[[16,14,17,14],[9,5,9,6],[9,7,9,8],[15,5,15,6],[15,8,15,9],[16,13,17,13]]}
[null,"Miscellaneous Measures",null,null,null,null,null,null,null,null,null,"HIDE","HIDE","HIDE","HIDE","HIDE","HIDE","HIDE","HIDE","HIDE","HIDE"]
[null,"Click on headings to expand or collapse sections. Blue Peak kW values indicate winter peak."]
[null,"Window Film Treatment"]
[null,"Peak kW","NCP kW","kWh","Area of Window Film (square feet)","Window Orientation","Pre Shading Type","Post Shading Coefficient\n(from manufacturer specs)","HVAC Type",null,null,"SHG","SHGF","SHGF NC","SCpre","SCpost","Conversion Factor (Btu/kW)","COP","kWh"]
[null,{"$f":"IFERROR(IF(H5=\"\",0,E5*M5*(O5-P5)/(Q5*R5)),0)","v":0},{"$f":"IFERROR(IF(H5=\"\",0,E5*N5*(O5-P5)/(Q5*R5)),0)","v":0},{"$f":"IFERROR(IF(H5=\"\",0,S5),0)","v":0},null,null,null,null,null,null,null,{"$f":"VLOOKUP(F5,'Lookup tables'!$D$488:$E$496,2,FALSE)","v":{"$error":"#N/A"}},{"$f":"VLOOKUP(F5,'Lookup tables'!$D$488:$K$496,MATCH(State&SelectedZone,'Lookup tables'!$D$487:$K$487,0),FALSE)","v":{"$error":"#N/A"}},{"$f":"INDEX('Lookup tables'!L$488:L$496,MATCH(Misc!F5,Orientation,0))","v":{"$error":"#N/A"}},{"$f":"VLOOKUP(G5,'Lookup tables'!$O$488:$P$493,2,FALSE)","v":{"$error":"#N/A"}},{"$f":"H5","v":0},3413,{"$f":"VLOOKUP(I5,'Lookup tables'!$R$488:$S$492,2,FALSE)","v":{"$error":"#N/A"}},{"$f":"E5*L5*(O5-P5)/(Q5*R5)","v":{"$error":"#N/A"}}]
[null,{"$f":"IFERROR(IF(H6=\"\",0,E6*M6*(O6-P6)/(Q6*R6)),0)","v":0},{"$f":"IFERROR(IF(H6=\"\",0,E6*N6*(O6-P6)/(Q6*R6)),0)","v":0},{"$f":"IFERROR(IF(H6=\"\",0,S6),0)","v":0},null,null,null,null,null,null,null,{"$f":"VLOOKUP(F6,'Lookup tables'!$D$488:$E$496,2,FALSE)","v":{"$error":"#N/A"}},{"$f":"VLOOKUP(F6,'Lookup tables'!$D$488:$K$496,MATCH(State&SelectedZone,'Lookup tables'!$D$487:$K$487,0),FALSE)","v":{"$error":"#N/A"}},{"$f":"INDEX('Lookup tables'!L$488:L$496,MATCH(Misc!F6,Orientation,0))","v":{"$error":"#N/A"}},{"$f":"VLOOKUP(G6,'Lookup tables'!$O$488:$P$493,2,FALSE)","v":{"$error":"#N/A"}},{"$f":"H6","v":0},3413,{"$f":"VLOOKUP(I6,'Lookup tables'!$R$488:$S$492,2,FALSE)","v":{"$error":"#N/A"}},{"$f":"E6*L6*(O6-P6)/(Q6*R6)","v":{"$error":"#N/A"}}]
{"$rows_left_out":29}
{"sheet":"Lookup tables","index":9,"n_rows":681,"n_cols":32,"rows_kept":681,"cut":false,"hidden":true,"merged":[[388,1,389,1],[425,10,425,15],[663,1,664,1],[485,14,485,15],[645,20,645,23],[485,17,485,18],[406,1,407,1],[654,1,655,1],[484,1,485,1],[645,24,645,27],[644,1,645,1],[645,4,645,7],[645,8,645,11],[645,12,645,15],[645,16,645,19],[303,16,303,27],[358,1,359,1],[303,1,304,1],[303,4,303,15],[185,1,186,1],[213,1,214,1],[242,1,243,1],[264,1,265,1],[135,2,136,2],[167,1,168,1],[173,1,174,1],[497,1,498,1],[484,5,484,7],[425,3,425,9],[139,1,140,1],[474,1,475,1],[484,8,484,10],[397,1,398,1],[398,4,398,6],[398,7,399,7],[193,1,194,1],[206,1,207,1],[329,1,330,1],[178,1,179,1],[1,1,2,1],[133,2,134,2],[9,1,10,1],[21,1,22,1],[32,1,33,1],[124,1,127,1],[118,1,119,1],[42,1,43,1],[67,1,68,1],[131,2,132,2]]}
[null,null,null,null,"TX","CPS","TX","CPS","TX","CPS"]
[null,"Door Gaskets",null,null,"kWh","kWh","kW","kW","NCP kW","NCP kW"]
[null,null,null,"Low Temperature",26.5,115,3.0000000000000001E-3,6.7600000000000004E-3,0,6.8900000000000003E-3]
[null,null,null,"Medium Temperature",3.5,15,4.0000000000000002E-4,1.2899999999999999E-3,0,1.32E-3]
[]
[]
{"$rows_left_out":676}
{"sheet":"County to Zone","index":10,"n_rows":257,"n_cols":5,"rows_kept":257,"cut":false,"hidden":true,"merged":[]}
["TX",null,null,"Selected Zone:",{"$f":"IF(Utility=\"CPS Energy\",\"CPS\",INDEX(INDIRECT(State&\"ZONE\"),MATCH(County,INDIRECT(State&\"ZONE[County]\"),0),2))","v":{"$error":"#N/A"}}]
["County","Zone"]
["Anderson",2]
["Andrews",2]
["Angelina",2]
["Aransas",4]
{"$rows_left_out":252}
{"sheet":"Utility Admin","index":11,"n_rows":53,"n_cols":61,"rows_kept":53,"cut":false,"hidden":true,"merged":[[2,6,3,6],[2,18,2,22],[2,23,2,25],[2,1,3,1],[2,2,3,2],[2,3,3,3],[2,4,3,4],[2,5,3,5],[2,13,3,13],[2,14,3,14],[2,15,3,15],[2,7,3,7],[2,8,3,8],[2,9,3,9],[2,10,3,10],[2,11,3,11],[2,56,2,60],[2,41,2,45],[2,48,2,52],[2,53,2,55],[2,26,2,30],[2,33,2,37],[2,38,2,40],[2,12,3,12]]}
[null,null,null,null,null,null,null,null,null,null,null,null,null,null,null,null,"$/NCPkW","$/NCPkW","$/NCPkW","$/NCPkW","$/NCPkW","$/NCPkW","$/NCPkW","$/NCPkW","$/NCPkW","$/NCPkW","$/NCPkW","$/NCPkW","$/NCPkW","$/NCPkW","$/NCPkW","$/kW","$/kW","$/kW","$/kW","$/kW","$/kW","$/kW","$/kW","$/kW","$/kW","$/kW","$/kW","$/kW","$/kW","$/kW","$/kWh","$/kWh","$/kWh","$/kWh","$/kWh","$/kWh","$/kWh","$/kWh","$/kWh","$/kWh","$/kWh","$/kWh","$/kWh","$/kWh","$/kWh"]
[null,{"$f":"'Project Info'!D9","v":"TX"},{"$f":"'Project Info'!I9","v":0},{"$f":"B2&C2","v":"TX0"},{"$f":"'Project Info'!I10","v":0},{"$f":"D2&E2","v":"TX00"},{"$f":"IF('Project Info'!$I$9=\"\",0,INDEX(G5:G21,MATCH($F2,$F$5:$F$21,0),1))","v":0},{"$f":"IF('Project Info'!$I$9=\"\",0,INDEX(H5:H21,MATCH($F2,$F$5:$F$21,0),1))","v":0},{"$f":"IF('Project Info'!$I$9=\"\",0,IF(INDEX(I5:I21,MATCH($F2,$F$5:$F$21,0),1)=0,999999,INDEX(I5:I21,MATCH($F2,$F$5:$F$21,0),1)))","v":0},{"$f":"IF('Project Info'!$I$9=\"\",0,INDEX(J5:J21,MATCH($F2,$F$5:$F$21,0),1))","v":0},{"$f":"IF('Project Info'!$I$9=\"\",0,INDEX(K5:K21,MATCH($F2,$F$5:$F$21,0),1))","v":0},{"$f":"IF('Project Info'!$I$9=\"\",0,INDEX(L5:L21,MATCH($F2,$F$5:$F$21,0),1))","v":0},{"$f":"IF('Project Info'!$I$9=\"\",0,INDEX(M5:M21,MATCH($F2,$F$5:$F$21,0),1))","v":0},{"$f":"IF('Project Info'!$I$9=\"\",0,INDEX(N5:N21,MATCH($F2,$F$5:$F$21,0),1))","v":0},{"$f":"IF('Project Info'!$I$9=\"\",0,INDEX(O5:O21,MATCH($F2,$F$5:$F$21,0),1))","v":0},{"$f":"IF('Project Info'!$I$9=\"\",0,INDEX(P5:P21,MATCH($C2,$C$5:$C$21,0),1))","v":0},{"$f":"IF($C$2=\"\",0,INDEX(Q5:Q21,MATCH($F2,$F$5:$F$21,0),1))","v":{"$error":"#N/A"}},{"$error":"#N/A"},{"$error":"#N/A"},{"$error":"#N/A"},{"$error":"#N/A"},{"$error":"#N/A"},{"$error":"#N/A"},{"$error":"#N/A"},{"$error":"#N/A"},{"$error":"#N/A"},{"$error":"#N/A"},{"$error":"#N/A"},{"$error":"#N/A"},{"$error":"#N/A"},{"$error":"#N/A"},{"$error":"#N/A"},{"$error":"#N/A"},{"$error":"#N/A"},{"$error":"#N/A"},{"$error":"#N/A"},{"$error":"#N/A"},{"$error":"#N/A"},{"$error":"#N/A"},{"$error":"#N/A"},{"$error":"#N/A"},{"$error":"#N/A"},{"$error":"#N/A"},{"$error":"#N/A"},{"$error":"#N/A"},{"$error":"#N/A"},{"$error":"#N/A"},{"$error":"#N/A"},{"$error":"#N/A"},{"$error":"#N/A"},{"$error":"#N/A"},{"$error":"#N/A"},{"$error":"#N/A"},{"$error":"#N/A"},{"$error":"#N/A"},{"$error":"#N/A"},{"$error":"#N/A"},{"$error":"#N/A"},{"$error":"#N/A"},{"$error":"#N/A"},{"$error":"#N/A"}]
[null,"State","Utility","StateUtility","Program","StateUtilityProgram","Max base","Max %","Max incentive","TRM","Load Factor","Discount","Escalation","AC kW","AC kWh","Abbreviated for Name Mgr",null,null,"HVAC",null,null,null,null,"Motors",null,null,"Miscellaneous",null,null,null,null,null,null,"HVAC",null,null,null,null,"Motors",null,null,"Miscellaneous",null,null,null,null,null,null,"HVAC",null,null,null,null,"Motors",null,null,"Miscellaneous"]
[null,null,null,null,null,null,null,null,null,null,null,null,null,null,null,null,"Refrigeration","Food Service","Variable Frequency Drives (VFD's)","Condenser Air Evaporative Pre-Cooling","Lodging Occupancy Controls","Commercial Smart Thermostats","High-Volume Low-Speed (HVLS) Fans","EnergyStar Commercial Pool Pumps","Premium Efficiency Motors","Pump Off Controller","Window Film Treatment","EnergyStar Roofing","Entrance & Exit Door Air Infiltration","PC Power Management","Central DHW Controls","Refrigeration","Food Service","Variable Frequency Drives (VFD's)","Condenser Air Evaporative Pre-Cooling","Lodging Occupancy Controls","Commercial Smart Thermostats","High-Volume Low-Speed (HVLS) Fans","EnergyStar Commercial Pool Pumps","Premium Efficiency Motors","Pump Off Controller","Window Film Treatment","EnergyStar Roofing","Entrance & Exit Door Air Infiltration","PC Power Management","Central DHW Controls","Refrigeration","Food Service","Variable Frequency Drives (VFD's)","Condenser Air Evaporative Pre-Cooling","Lodging Occupancy Controls","Commercial Smart Thermostats","High-Volume Low-Speed (HVLS) Fans","EnergyStar Commercial Pool Pumps","Premium Efficiency Motors","Pump Off Controller","Window Film Treatment","EnergyStar Roofing","Entrance & Exit Door Air Infiltration","PC Power Management","Central DHW Controls"]
[null,"TX","AEP SWEPCO",{"$f":"B5&C5","v":"TXAEP SWEPCO"},"Commercial Solutions",{"$f":"D5&E5","v":"TXAEP SWEPCOCommercial Solutions"},null,null,{"$f":"IF('Project Info'!$D$18=\"\",'Utility Admin'!G5,MIN(H5*'Project Info'!$D$18,G5))","v":0},"TX","No",0.02,7.1800000000000003E-2,80,0.11360000000000001,"SWEPCOTX",null,null,null,null,null,null,null,null,null,null,null,null,null,null,null,250,250,250,250,250,250,250,250,250,250,250,250,250,250,250,0,0,0,0,0,0,0,0,0,0,0,0,0,0,0]
[null,"TX","AEP SWEPCO","TXAEP SWEPCO","SCORE","TXAEP SWEPCOSCORE",null,null,{"$f":"IF('Project Info'!$D$18=\"\",'Utility Admin'!G6,MIN(H6*'Project Info'!$D$18,G6))","v":0},"TX","No",0.02,7.1800000000000003E-2,80,0.11360000000000001,"SWEPCOTX",null,null,null,null,null,null,null,null,null,null,null,null,null,null,null,250,250,250,250,250,250,250,250,250,250,250,250,250,250,250,0,0,0,0,0,0,0,0,0,0,0,0,0,0,0]
{"$rows_left_out":48}
{"sheet":"Version Log","index":12,"n_rows":110,"n_cols":7,"rows_kept":110,"cut":false,"hidden":true,"merged":[[1,1,1,5],[3,5,3,6],[4,2,4,3],[4,5,4,6]]}
[]
[null,"Version Log"]
[]
[null,"Original Author:","A. Boone Drummond / A Keeling",null,"QA/QC Engineer(s):","A. Boone Drummond"]
[null,"Primary Developer:","Adam Groenhuyzen",null,"Senior Engineer Approval:"]
[]
{"$rows_left_out":104}