{"text_format":"1","workbook":"xlsx","n_sheets":13,"sheets":["Instructions","Project Info","EPE PAF","Savings Summary","Refrigeration","Food Service","HVAC","Motors","Misc","Lookup tables","County to Zone","Utility Admin","Version Log"],"not_rendered":{"charts":0,"images":12,"macros":1,"external_links":0,"defined_names":138,"comments":0,"pivot_tables":0},"unopened":[],"bounds":{"document_bytes":16777216,"sheet_cells":100000,"rows_first":2000,"rows_last":500,"rows_between":2000,"halvings":0,"cell_chars":16384,"cell_head_chars":4096},"cells_cut":0,"cells_raw":0,"read":"whole","date_system":"1900"}

{"sheet":"Instructions","index":0,"n_rows":39,"n_cols":2,"rows_kept":39,"cut":false,"hidden":true,"merged":[[26,1,27,12],[34,1,35,13],[38,0,40,13],[1,0,2,12]]}
["Instructions"]
["This sheet provides basic instructions for using this calculator. Please contact the utility rebate program staff for further help or questions."]
[]
[]
["Getting Started"]
[]
[null,"After opening the file, enable macros if prompted. This tool uses macros to format the spreadsheets for different scenarios."]
[]
[]
[]
[]
[]
[]
[]
[]
[]
[]
[]
[]
[]
[]
[]
[]
["Project Info"]
[]
[]
["1.","Start with this sheet. Enter in all relevant information for the project. The minimum required fields are State, Utility, County, and Program; these fields have drop-downs."]
[]
["2.","Once the required information is filled in, use the macro buttons to the side to open up tabs for specific measures."]
[]
["Measure Tabs"]
["The \"Refrigeration\" and \"Food Service\" tabs feature multiple measures. Click on the individual measure headings to expand them and show the inputs."]
[]
["-","For all measures, follow the heading prompts and fill in all columns to calculate savings. Several columns use drop-downs."]
["-","For Refrigeration measures, \"Low Temperature\" refrigeration refers to freezers (32F and below) and \"Medium Temperature\" refers to coolers (33F to 41F)."]
[]
[]
["Savings Summary"]
["This tab shows the summary of savings for all energy conservation measures included in the project. This tab also shows the estimated incentives for each measure and for the total project. Some programs cap incentive based on project cost, this tab will also check for that if project cost has been entered."]

{"sheet":"Project Info","index":1,"n_rows":20,"n_cols":13,"rows_kept":20,"cut":false,"hidden":false,"merged":[[17,3,17,4],[19,3,19,10],[12,3,12,5],[12,9,12,10],[3,3,3,10],[4,3,4,10],[5,3,5,10],[6,3,6,10],[8,3,8,4],[8,8,8,9],[9,3,9,4],[9,8,9,9],[10,3,10,10],[11,3,11,4],[11,8,11,10],[1,1,1,6],[0,12,0,15],[13,3,13,10],[14,3,14,8],[16,3,16,4]]}
[null,"South \"Other Measures\" Calculator",null,null,null,null,null,null,null,null,"v20.0"]
[null,"A calculation tool for determining deemed savings for projects other than standard prescriptive lighting & HVAC replacements."]
[null,null,null,null,null,{"$f":"IF(OR(D9=\"\",D10=\"\",I9=\"\",I10=\"\"),\"Please fill in highlighted cells to continue.\",\"\")","v":"Please fill in highlighted cells to continue."},null,null,null,null,null,null,"Click buttons to open or close measures"]
[null,null,"Assessed by:"]
[null,null,"Project ID:"]
[null,null,"Project Name:"]
[null,null,"Project Sponsor:"]
[]
[null,null,"State:","TX",null,null,null,"Utility:"]
[null,null,{"$f":"IFERROR(IF('Project Info'!D9=\"LA\",\"Parish:\",\"County:\"),\"\")","v":"County:"},null,null,null,null,"Program:"]
[null,null,"Contact Name:"]
[null,null,"Contact Phone:",null,null,null,null,"Contact Email:"]
[null,null,"Account Number:",null,null,null,null,null,"Name on Account:"]
[null,null,"Project Site Address:"]
[null,null,"City:",null,null,null,null,null,null,"ZIP Code:"]
[]
[null,null,"Incentive Paid to:",null,null,null,null,null,"$/kWh","$/kW"]
[null,null,"Project Cost:",null,null,null,null,"Utility Rates:",0.1,0]
[]
[null,null,"Project Decription:"]

{"sheet":"EPE PAF","index":2,"n_rows":26,"n_cols":20,"rows_kept":26,"cut":false,"hidden":true,"merged":[[10,3,10,6],[10,9,10,16],[1,3,1,14],[2,3,2,14],[3,3,3,14],[4,5,4,12],[7,3,7,16],[8,3,8,6],[8,9,8,16],[9,3,9,5],[9,9,9,16],[11,3,11,16],[12,3,12,6],[12,9,12,11],[12,14,12,16],[14,2,14,5],[14,6,14,10],[14,11,14,15],[18,1,18,16],[24,14,24,16],[15,2,15,5],[15,6,15,10],[15,11,15,15],[24,4,24,11],[20,4,20,7],[25,1,25,16],[22,8,23,9],[19,14,19,16],[19,4,19,12],[20,11,20,16]]}
[]
[null,null,null,"EL PASO ELECTRIC",null,null,null,null,null,null,null,null,null,null,null,"",null,null,null,""]
[null,null,null,"SMALL COMMERCIAL SOLUTIONS PROGRAM"]
[null,null,null,"2020 PAYMENT REQUEST FOR MEASURES:"]
[null,null,null,null,null,{"$f":"'Savings Summary'!Q42","v":{"$error":"#VALUE!"}}]
[]
[null,"EPE Customer Information (as seen on EPE bill)"]
[null,null,"Company Name:"]
[null,null,"Contact Name:",null,null,null,null,null,"Title:"]
[null,null,"Contact Phone:",null,null,null,null,null,"Contact Email:"]
[null,null,"EPE Acct/Meter #:",null,null,null,null,null,"Rate:","Example: NMRT03"]
[null,null,"Service Address:"]
[null,null,"City:",null,null,null,null,null,"State:","Texas",null,null,null,"ZIP Code:"]
[]
[null,null,"Peak Demand kW Savings",null,null,null,"Energy kWh Savings",null,null,null,null,"El Paso Electric Rebate Amount"]
[null,null,{"$f":"'Savings Summary'!E5+'Savings Summary'!F5","v":0},null,null,null,{"$f":"'Savings Summary'!H5","v":0},null,null,null,null,{"$f":"'Savings Summary'!I5","v":0}]
[]
[]
[null,"I acknowledge the above measure will be installed and performed to my satisfaction. I understand the contractor is an independent contractor who is solely responsible for work provided and will be receiving the incentive from the El Paso Electric Company (EPE). I acknowledge that EPE and CLEAResult make no warranty or representation of the qualifications or technical feasibility, capability, safety or reliability of the measure installed by the contractor. I acknowledge that the project listed above would not have been accomplished or would have been completed with less efficient equipment without the assistance provided by the EPE Energy Efficiency Program. By signing below, I agree to give CLEAResult and/or EPE access to project site for inspections if necessary. Customer may contact EPE at (915) 351-4237 in the event of non-performance by contractor."]
[null,null,null,"CUSTOMER SIGNATURE:",null,null,null,null,null,null,null,null,null,"Date:"]
[null,null,null,"Contractor:",null,null,null,null,null,null,"Representative Name (Print):"]
[]
[null,null,null,null,null,null,null,null,"For Internal Use Only"]
[]
[null,null,null,"CLEAResult Signature:",null,null,null,null,null,null,null,null,null,"Date Reserved:"]
[null,"*Contractor must create project in the Contractor Portal to officially reserve funds. Funds will be reserved for 45 days, if project is not completed within this time, you will need to request an extension or funds will be forfeited."]

{"sheet":"Savings Summary","index":3,"n_rows":46,"n_cols":17,"rows_kept":46,"cut":false,"hidden":false,"merged":[[45,7,47,9],[7,1,16,1],[6,1,6,2],[17,1,27,1],[28,1,32,1],[33,1,35,1],[36,1,40,1]]}
[null,"Savings Summary",null,null,null,null,null,null,null,null,"HIDE","HIDE","HIDE","HIDE","HIDE","HIDE","HIDE"]
[null,null,"Project Name:",{"$f":"IF('Project Info'!D6:K6=\"\",\"\",'Project Info'!D6:K6)","v":""}]
[]
[null,null,null,null,"Total Summer Peak kW Savings","Total Winter Peak kW Savings","Total Non-Coincident kW Savings","Total kWh Savings","Total Incentive*","Total Project Cost","Non-Capped Incentive"]
[null,null,null,null,{"$f":"SUM(E8:E41)","v":0},{"$f":"SUM(F8:F41)","v":0},{"$f":"SUM(G8:G41)","v":0},{"$f":"SUM(H8:H41)","v":0},{"$f":"IF(I43=\"Yes\",'Utility Admin'!I2,K5)","v":0},{"$f":"IF('Project Info'!D18=\"\",\"Not Entered\",'Project Info'!D18)","v":"Not Entered"},{"$f":"SUM(K8:K41)","v":0}]
[]
[null,"Measure Category",null,"EUL","Summer Peak kW Savings","Winter Peak kW Savings","Non-Coincident kW Savings","kWh Savings","Incentive*","Estimated Measure Cost","Non-Capped Incentive","kWh Savings","Load Factor Applied?","$/kW","$/NCPkW","$/kWh","Names for EPE measure list"]
[null,"Refrigeration","Door Gaskets",4,{"$f":"Refrigeration!B10","v":0},0,{"$f":"Refrigeration!C10","v":0},{"$f":"IF(M8=1,E8*LoadFactor,L8)","v":0},{"$f":"IF(I$43=\"Yes\",L8/H$5*I$5,K8)","v":0},{"$f":"IF(OR(J$5=\"Not Entered\",$H$5=0),0,H8/$H$5*$J$5)","v":0},{"$f":"IFERROR(G8*O8+(E8+F8)*N8+H8*P8,0)","v":0},{"$f":"Refrigeration!D10","v":0},{"$f":"IF(LoadFactor=\"No\",0,IF(L8>E8*LoadFactor,1,0))","v":0},{"$f":"INDEX('Utility Admin'!$Q$2:$BI$2,1,MATCH(1,($B$8='Utility Admin'!$Q$4:$BI$4)*('Savings Summary'!N$7='Utility Admin'!$Q$1:$BI$1),0))","v":{"$error":"#N/A"}},{"$f":"INDEX('Utility Admin'!$Q$2:$BI$2,1,MATCH(1,($B$8='Utility Admin'!$Q$4:$BI$4)*('Savings Summary'!O$7='Utility Admin'!$Q$1:$BI$1),0))","v":{"$error":"#N/A"}},{"$f":"INDEX('Utility Admin'!$Q$2:$BI$2,1,MATCH(1,($B$8='Utility Admin'!$Q$4:$BI$4)*('Savings Summary'!P$7='Utility Admin'!$Q$1:$BI$1),0))","v":{"$error":"#N/A"}},{"$f":"IF(H8<>0,C8&\", \",\"\")","v":""}]
[null,null,"Door Heater Controls",12,{"$f":"Refrigeration!B16","v":0},0,{"$f":"Refrigeration!C16","v":0},0,{"$f":"IF(I$43=\"Yes\",L9/H$5*I$5,K9)","v":0},{"$f":"IF(OR(J$5=\"Not Entered\",$H$5=0),0,H9/$H$5*$J$5)","v":0},{"$f":"IFERROR(G9*O9+(E9+F9)*N9+H9*P9,0)","v":0},{"$f":"Refrigeration!D16","v":0},0,{"$f":"INDEX('Utility Admin'!$Q$2:$BI$2,1,MATCH(1,($B$8='Utility Admin'!$Q$4:$BI$4)*('Savings Summary'!N$7='Utility Admin'!$Q$1:$BI$1),0))","v":{"$error":"#N/A"}},{"$f":"INDEX('Utility Admin'!$Q$2:$BI$2,1,MATCH(1,($B$8='Utility Admin'!$Q$4:$BI$4)*('Savings Summary'!O$7='Utility Admin'!$Q$1:$BI$1),0))","v":{"$error":"#N/A"}},{"$f":"INDEX('Utility Admin'!$Q$2:$BI$2,1,MATCH(1,($B$8='Utility Admin'!$Q$4:$BI$4)*('Savings Summary'!P$7='Utility Admin'!$Q$1:$BI$1),0))","v":{"$error":"#N/A"}},{"$f":"IF(H9<>0,C9&\", \",\"\")","v":""}]
[null,null,"ECM Evaporator Fan Motor",15,{"$f":"Refrigeration!B27","v":0},0,{"$f":"Refrigeration!C27","v":0},0,0,{"$f":"IF(OR(J$5=\"Not Entered\",$H$5=0),0,H10/$H$5*$J$5)","v":0},0,{"$f":"Refrigeration!D27","v":0},0,{"$f":"INDEX('Utility Admin'!$Q$2:$BI$2,1,MATCH(1,($B$8='Utility Admin'!$Q$4:$BI$4)*('Savings Summary'!N$7='Utility Admin'!$Q$1:$BI$1),0))","v":{"$error":"#N/A"}},{"$f":"INDEX('Utility Admin'!$Q$2:$BI$2,1,MATCH(1,($B$8='Utility Admin'!$Q$4:$BI$4)*('Savings Summary'!O$7='Utility Admin'!$Q$1:$BI$1),0))","v":{"$error":"#N/A"}},{"$f":"INDEX('Utility Admin'!$Q$2:$BI$2,1,MATCH(1,($B$8='Utility Admin'!$Q$4:$BI$4)*('Savings Summary'!P$7='Utility Admin'!$Q$1:$BI$1),0))","v":{"$error":"#N/A"}},{"$f":"IF(H10<>0,C10&\", \",\"\")","v":""}]
[null,null,"Electronic Defrost Controls",10,{"$f":"Refrigeration!B35","v":0},0,{"$f":"Refrigeration!C35","v":0},0,0,0,0,{"$f":"Refrigeration!D35","v":0},0,{"$f":"INDEX('Utility Admin'!$Q$2:$BI$2,1,MATCH(1,($B$8='Utility Admin'!$Q$4:$BI$4)*('Savings Summary'!N$7='Utility Admin'!$Q$1:$BI$1),0))","v":{"$error":"#N/A"}},{"$f":"INDEX('Utility Admin'!$Q$2:$BI$2,1,MATCH(1,($B$8='Utility Admin'!$Q$4:$BI$4)*('Savings Summary'!O$7='Utility Admin'!$Q$1:$BI$1),0))","v":{"$error":"#N/A"}},{"$f":"INDEX('Utility Admin'!$Q$2:$BI$2,1,MATCH(1,($B$8='Utility Admin'!$Q$4:$BI$4)*('Savings Summary'!P$7='Utility Admin'!$Q$1:$BI$1),0))","v":{"$error":"#N/A"}},""]
[null,null,"Evaporator Fan Controls",16,{"$f":"Refrigeration!B41","v":0},0,{"$f":"Refrigeration!C41","v":0},0,0,0,0,{"$f":"Refrigeration!D41","v":0},0,{"$f":"INDEX('Utility Admin'!$Q$2:$BI$2,1,MATCH(1,($B$8='Utility Admin'!$Q$4:$BI$4)*('Savings Summary'!N$7='Utility Admin'!$Q$1:$BI$1),0))","v":{"$error":"#N/A"}},{"$f":"INDEX('Utility Admin'!$Q$2:$BI$2,1,MATCH(1,($B$8='Utility Admin'!$Q$4:$BI$4)*('Savings Summary'!O$7='Utility Admin'!$Q$1:$BI$1),0))","v":{"$error":"#N/A"}},{"$f":"INDEX('Utility Admin'!$Q$2:$BI$2,1,MATCH(1,($B$8='Utility Admin'!$Q$4:$BI$4)*('Savings Summary'!P$7='Utility Admin'!$Q$1:$BI$1),0))","v":{"$error":"#N/A"}},""]
[null,null,"Night Covers",5,{"$f":"Refrigeration!B49","v":0},0,{"$f":"Refrigeration!C49","v":0},0,0,0,0,{"$f":"Refrigeration!D49","v":0},"N/A",{"$f":"INDEX('Utility Admin'!$Q$2:$BI$2,1,MATCH(1,($B$8='Utility Admin'!$Q$4:$BI$4)*('Savings Summary'!N$7='Utility Admin'!$Q$1:$BI$1),0))","v":{"$error":"#N/A"}},{"$f":"INDEX('Utility Admin'!$Q$2:$BI$2,1,MATCH(1,($B$8='Utility Admin'!$Q$4:$BI$4)*('Savings Summary'!O$7='Utility Admin'!$Q$1:$BI$1),0))","v":{"$error":"#N/A"}},{"$f":"INDEX('Utility Admin'!$Q$2:$BI$2,1,MATCH(1,($B$8='Utility Admin'!$Q$4:$BI$4)*('Savings Summary'!P$7='Utility Admin'!$Q$1:$BI$1),0))","v":{"$error":"#N/A"}},""]
[null,null,"Solid & Glass Door Reach-Ins",12,{"$f":"Refrigeration!B57","v":0},0,{"$f":"Refrigeration!C57","v":0},0,0,0,0,{"$f":"Refrigeration!D57","v":0},0,{"$f":"INDEX('Utility Admin'!$Q$2:$BI$2,1,MATCH(1,($B$8='Utility Admin'!$Q$4:$BI$4)*('Savings Summary'!N$7='Utility Admin'!$Q$1:$BI$1),0))","v":{"$error":"#N/A"}},{"$f":"INDEX('Utility Admin'!$Q$2:$BI$2,1,MATCH(1,($B$8='Utility Admin'!$Q$4:$BI$4)*('Savings Summary'!O$7='Utility Admin'!$Q$1:$BI$1),0))","v":{"$error":"#N/A"}},{"$f":"INDEX('Utility Admin'!$Q$2:$BI$2,1,MATCH(1,($B$8='Utility Admin'!$Q$4:$BI$4)*('Savings Summary'!P$7='Utility Admin'!$Q$1:$BI$1),0))","v":{"$error":"#N/A"}},""]
[null,null,"Strip Curtains",4,{"$f":"Refrigeration!B63","v":0},0,{"$f":"Refrigeration!C63","v":0},0,0,0,0,{"$f":"Refrigeration!D63","v":0},0,{"$f":"INDEX('Utility Admin'!$Q$2:$BI$2,1,MATCH(1,($B$8='Utility Admin'!$Q$4:$BI$4)*('Savings Summary'!N$7='Utility Admin'!$Q$1:$BI$1),0))","v":{"$error":"#N/A"}},{"$f":"INDEX('Utility Admin'!$Q$2:$BI$2,1,MATCH(1,($B$8='Utility Admin'!$Q$4:$BI$4)*('Savings Summary'!O$7='Utility Admin'!$Q$1:$BI$1),0))","v":{"$error":"#N/A"}},{"$f":"INDEX('Utility Admin'!$Q$2:$BI$2,1,MATCH(1,($B$8='Utility Admin'!$Q$4:$BI$4)*('Savings Summary'!P$7='Utility Admin'!$Q$1:$BI$1),0))","v":{"$error":"#N/A"}},""]
[null,null,"Vending Machine Controls",5,{"$f":"Refrigeration!B69","v":0},0,{"$f":"Refrigeration!C69","v":0},0,0,0,0,{"$f":"Refrigeration!D69","v":0},0,{"$f":"INDEX('Utility Admin'!$Q$2:$BI$2,1,MATCH(1,($B$8='Utility Admin'!$Q$4:$BI$4)*('Savings Summary'!N$7='Utility Admin'!$Q$1:$BI$1),0))","v":{"$error":"#N/A"}},{"$f":"INDEX('Utility Admin'!$Q$2:$BI$2,1,MATCH(1,($B$8='Utility Admin'!$Q$4:$BI$4)*('Savings Summary'!O$7='Utility Admin'!$Q$1:$BI$1),0))","v":{"$error":"#N/A"}},{"$f":"INDEX('Utility Admin'!$Q$2:$BI$2,1,MATCH(1,($B$8='Utility Admin'!$Q$4:$BI$4)*('Savings Summary'!P$7='Utility Admin'!$Q$1:$BI$1),0))","v":{"$error":"#N/A"}},""]
[null,null,"Zero-Energy Doors",12,{"$f":"Refrigeration!B75","v":0},0,{"$f":"Refrigeration!C75","v":0},0,0,{"$f":"IF(OR(J$5=\"Not Entered\",$H$5=0),0,H17/$H$5*$J$5)","v":0},0,{"$f":"Refrigeration!D75","v":0},0,{"$f":"INDEX('Utility Admin'!$Q$2:$BI$2,1,MATCH(1,($B$8='Utility Admin'!$Q$4:$BI$4)*('Savings Summary'!N$7='Utility Admin'!$Q$1:$BI$1),0))","v":{"$error":"#N/A"}},{"$f":"INDEX('Utility Admin'!$Q$2:$BI$2,1,MATCH(1,($B$8='Utility Admin'!$Q$4:$BI$4)*('Savings Summary'!O$7='Utility Admin'!$Q$1:$BI$1),0))","v":{"$error":"#N/A"}},{"$f":"INDEX('Utility Admin'!$Q$2:$BI$2,1,MATCH(1,($B$8='Utility Admin'!$Q$4:$BI$4)*('Savings Summary'!P$7='Utility Admin'!$Q$1:$BI$1),0))","v":{"$error":"#N/A"}},""]
[null,"Food Service","Electric Convection Oven",12,{"$f":"'Food Service'!B8","v":0},0,{"$f":"'Food Service'!C8","v":0},0,0,{"$f":"IF(OR(J$5=\"Not Entered\",$H$5=0),0,H18/$H$5*$J$5)","v":0},0,{"$f":"'Food Service'!D8","v":0},0,{"$f":"INDEX('Utility Admin'!$Q$2:$BI$2,1,MATCH(1,($B$18='Utility Admin'!$Q$4:$BI$4)*('Savings Summary'!N$7='Utility Admin'!$Q$1:$BI$1),0))","v":{"$error":"#N/A"}},{"$f":"INDEX('Utility Admin'!$Q$2:$BI$2,1,MATCH(1,($B$18='Utility Admin'!$Q$4:$BI$4)*('Savings Summary'!O$7='Utility Admin'!$Q$1:$BI$1),0))","v":{"$error":"#N/A"}},{"$f":"INDEX('Utility Admin'!$Q$2:$BI$2,1,MATCH(1,($B$18='Utility Admin'!$Q$4:$BI$4)*('Savings Summary'!P$7='Utility Admin'!$Q$1:$BI$1),0))","v":{"$error":"#N/A"}},""]
[null,null,"Electric Combination Oven",12,{"$f":"'Food Service'!B14","v":0},0,{"$f":"'Food Service'!C14","v":0},0,0,{"$f":"IF(OR(J$5=\"Not Entered\",$H$5=0),0,H19/$H$5*$J$5)","v":0},0,{"$f":"'Food Service'!D14","v":0},0,{"$f":"INDEX('Utility Admin'!$Q$2:$BI$2,1,MATCH(1,($B$18='Utility Admin'!$Q$4:$BI$4)*('Savings Summary'!N$7='Utility Admin'!$Q$1:$BI$1),0))","v":{"$error":"#N/A"}},{"$f":"INDEX('Utility Admin'!$Q$2:$BI$2,1,MATCH(1,($B$18='Utility Admin'!$Q$4:$BI$4)*('Savings Summary'!O$7='Utility Admin'!$Q$1:$BI$1),0))","v":{"$error":"#N/A"}},{"$f":"INDEX('Utility Admin'!$Q$2:$BI$2,1,MATCH(1,($B$18='Utility Admin'!$Q$4:$BI$4)*('Savings Summary'!P$7='Utility Admin'!$Q$1:$BI$1),0))","v":{"$error":"#N/A"}},""]
[null,null,"Commercial Dishwashers",11,{"$f":"'Food Service'!B20","v":0},0,{"$f":"'Food Service'!C20","v":0},0,0,{"$f":"IF(OR(J$5=\"Not Entered\",$H$5=0),0,H20/$H$5*$J$5)","v":0},0,{"$f":"'Food Service'!D20","v":0},0,{"$f":"INDEX('Utility Admin'!$Q$2:$BI$2,1,MATCH(1,($B$18='Utility Admin'!$Q$4:$BI$4)*('Savings Summary'!N$7='Utility Admin'!$Q$1:$BI$1),0))","v":{"$error":"#N/A"}},{"$f":"INDEX('Utility Admin'!$Q$2:$BI$2,1,MATCH(1,($B$18='Utility Admin'!$Q$4:$BI$4)*('Savings Summary'!O$7='Utility Admin'!$Q$1:$BI$1),0))","v":{"$error":"#N/A"}},{"$f":"INDEX('Utility Admin'!$Q$2:$BI$2,1,MATCH(1,($B$18='Utility Admin'!$Q$4:$BI$4)*('Savings Summary'!P$7='Utility Admin'!$Q$1:$BI$1),0))","v":{"$error":"#N/A"}},""]
[null,null,"Electric Steam Cookers",12,{"$f":"'Food Service'!B26","v":0},0,{"$f":"'Food Service'!C26","v":0},0,0,0,0,{"$f":"'Food Service'!D26","v":0},0,{"$f":"INDEX('Utility Admin'!$Q$2:$BI$2,1,MATCH(1,($B$18='Utility Admin'!$Q$4:$BI$4)*('Savings Summary'!N$7='Utility Admin'!$Q$1:$BI$1),0))","v":{"$error":"#N/A"}},{"$f":"INDEX('Utility Admin'!$Q$2:$BI$2,1,MATCH(1,($B$18='Utility Admin'!$Q$4:$BI$4)*('Savings Summary'!O$7='Utility Admin'!$Q$1:$BI$1),0))","v":{"$error":"#N/A"}},{"$f":"INDEX('Utility Admin'!$Q$2:$BI$2,1,MATCH(1,($B$18='Utility Admin'!$Q$4:$BI$4)*('Savings Summary'!P$7='Utility Admin'!$Q$1:$BI$1),0))","v":{"$error":"#N/A"}},""]
[null,null,"Kitchen Electric Fryers",12,{"$f":"'Food Service'!B32","v":0},0,{"$f":"'Food Service'!C32","v":0},0,0,0,0,{"$f":"'Food Service'!D32","v":0},0,{"$f":"INDEX('Utility Admin'!$Q$2:$BI$2,1,MATCH(1,($B$18='Utility Admin'!$Q$4:$BI$4)*('Savings Summary'!N$7='Utility Admin'!$Q$1:$BI$1),0))","v":{"$error":"#N/A"}},{"$f":"INDEX('Utility Admin'!$Q$2:$BI$2,1,MATCH(1,($B$18='Utility Admin'!$Q$4:$BI$4)*('Savings Summary'!O$7='Utility Admin'!$Q$1:$BI$1),0))","v":{"$error":"#N/A"}},{"$f":"INDEX('Utility Admin'!$Q$2:$BI$2,1,MATCH(1,($B$18='Utility Admin'!$Q$4:$BI$4)*('Savings Summary'!P$7='Utility Admin'!$Q$1:$BI$1),0))","v":{"$error":"#N/A"}},""]
[null,null,"Hot Food Holding Cabinet",12,{"$f":"'Food Service'!B38","v":0},0,{"$f":"'Food Service'!C38","v":0},0,0,0,0,{"$f":"'Food Service'!D38","v":0},0,{"$f":"INDEX('Utility Admin'!$Q$2:$BI$2,1,MATCH(1,($B$18='Utility Admin'!$Q$4:$BI$4)*('Savings Summary'!N$7='Utility Admin'!$Q$1:$BI$1),0))","v":{"$error":"#N/A"}},{"$f":"INDEX('Utility Admin'!$Q$2:$BI$2,1,MATCH(1,($B$18='Utility Admin'!$Q$4:$BI$4)*('Savings Summary'!O$7='Utility Admin'!$Q$1:$BI$1),0))","v":{"$error":"#N/A"}},{"$f":"INDEX('Utility Admin'!$Q$2:$BI$2,1,MATCH(1,($B$18='Utility Admin'!$Q$4:$BI$4)*('Savings Summary'!P$7='Utility Admin'!$Q$1:$BI$1),0))","v":{"$error":"#N/A"}},""]
[null,null,"Low Flow Pre-Rinse Spray Valve",5,{"$f":"'Food Service'!B44","v":0},0,{"$f":"'Food Service'!C44","v":0},0,0,0,0,{"$f":"'Food Service'!D44","v":0},0,{"$f":"INDEX('Utility Admin'!$Q$2:$BI$2,1,MATCH(1,($B$18='Utility Admin'!$Q$4:$BI$4)*('Savings Summary'!N$7='Utility Admin'!$Q$1:$BI$1),0))","v":{"$error":"#N/A"}},{"$f":"INDEX('Utility Admin'!$Q$2:$BI$2,1,MATCH(1,($B$18='Utility Admin'!$Q$4:$BI$4)*('Savings Summary'!O$7='Utility Admin'!$Q$1:$BI$1),0))","v":{"$error":"#N/A"}},{"$f":"INDEX('Utility Admin'!$Q$2:$BI$2,1,MATCH(1,($B$18='Utility Admin'!$Q$4:$BI$4)*('Savings Summary'!P$7='Utility Admin'!$Q$1:$BI$1),0))","v":{"$error":"#N/A"}},""]
[null,null,"Low Flow Aerators",10,{"$f":"'Food Service'!B50","v":0},0,{"$f":"'Food Service'!C50","v":0},0,0,{"$f":"IF(OR(J$5=\"Not Entered\",$H$5=0),0,H25/$H$5*$J$5)","v":0},0,{"$f":"'Food Service'!D50","v":0},0,{"$f":"INDEX('Utility Admin'!$Q$2:$BI$2,1,MATCH(1,($B$18='Utility Admin'!$Q$4:$BI$4)*('Savings Summary'!N$7='Utility Admin'!$Q$1:$BI$1),0))","v":{"$error":"#N/A"}},{"$f":"INDEX('Utility Admin'!$Q$2:$BI$2,1,MATCH(1,($B$18='Utility Admin'!$Q$4:$BI$4)*('Savings Summary'!O$7='Utility Admin'!$Q$1:$BI$1),0))","v":{"$error":"#N/A"}},{"$f":"INDEX('Utility Admin'!$Q$2:$BI$2,1,MATCH(1,($B$18='Utility Admin'!$Q$4:$BI$4)*('Savings Summary'!P$7='Utility Admin'!$Q$1:$BI$1),0))","v":{"$error":"#N/A"}},""]
[null,null,"Low Flow Showerheads",10,{"$f":"'Food Service'!B56","v":0},0,{"$f":"'Food Service'!C56","v":0},0,0,{"$f":"IF(OR(J$5=\"Not Entered\",$H$5=0),0,H26/$H$5*$J$5)","v":0},0,{"$f":"'Food Service'!D56","v":0},0,{"$f":"INDEX('Utility Admin'!$Q$2:$BI$2,1,MATCH(1,($B$18='Utility Admin'!$Q$4:$BI$4)*('Savings Summary'!N$7='Utility Admin'!$Q$1:$BI$1),0))","v":{"$error":"#N/A"}},{"$f":"INDEX('Utility Admin'!$Q$2:$BI$2,1,MATCH(1,($B$18='Utility Admin'!$Q$4:$BI$4)*('Savings Summary'!O$7='Utility Admin'!$Q$1:$BI$1),0))","v":{"$error":"#N/A"}},{"$f":"INDEX('Utility Admin'!$Q$2:$BI$2,1,MATCH(1,($B$18='Utility Admin'!$Q$4:$BI$4)*('Savings Summary'!P$7='Utility Admin'!$Q$1:$BI$1),0))","v":{"$error":"#N/A"}},""]
[null,null,"Kitchen Demand Control Ventilation",15,0,{"$f":"'Food Service'!W64","v":0},{"$f":"'Food Service'!C64","v":0},{"$f":"IF(M27=1,E27*LoadFactor,L27)","v":0},0,{"$f":"IF(OR(J$5=\"Not Entered\",$H$5=0),0,H27/$H$5*$J$5)","v":0},0,{"$f":"'Food Service'!D64","v":0},0,{"$f":"INDEX('Utility Admin'!$Q$2:$BI$2,1,MATCH(1,($B$18='Utility Admin'!$Q$4:$BI$4)*('Savings Summary'!N$7='Utility Admin'!$Q$1:$BI$1),0))","v":{"$error":"#N/A"}},{"$f":"INDEX('Utility Admin'!$Q$2:$BI$2,1,MATCH(1,($B$18='Utility Admin'!$Q$4:$BI$4)*('Savings Summary'!O$7='Utility Admin'!$Q$1:$BI$1),0))","v":{"$error":"#N/A"}},{"$f":"INDEX('Utility Admin'!$Q$2:$BI$2,1,MATCH(1,($B$18='Utility Admin'!$Q$4:$BI$4)*('Savings Summary'!P$7='Utility Admin'!$Q$1:$BI$1),0))","v":{"$error":"#N/A"}},""]
[null,null,"Commercial Ice Makers",8.5,{"$f":"'Food Service'!B72","v":0},0,{"$f":"'Food Service'!C72","v":0},0,0,0,0,{"$f":"'Food Service'!D72","v":0},0,{"$f":"INDEX('Utility Admin'!$Q$2:$BI$2,1,MATCH(1,($B$18='Utility Admin'!$Q$4:$BI$4)*('Savings Summary'!N$7='Utility Admin'!$Q$1:$BI$1),0))","v":{"$error":"#N/A"}},{"$f":"INDEX('Utility Admin'!$Q$2:$BI$2,1,MATCH(1,($B$18='Utility Admin'!$Q$4:$BI$4)*('Savings Summary'!O$7='Utility Admin'!$Q$1:$BI$1),0))","v":{"$error":"#N/A"}},{"$f":"INDEX('Utility Admin'!$Q$2:$BI$2,1,MATCH(1,($B$18='Utility Admin'!$Q$4:$BI$4)*('Savings Summary'!P$7='Utility Admin'!$Q$1:$BI$1),0))","v":{"$error":"#N/A"}},""]
[null,"HVAC","Variable Frequency Drives (VFD's)",15,{"$f":"HVAC!M15","v":0},{"$f":"HVAC!N15","v":0},{"$f":"HVAC!C15","v":0},{"$f":"IF(M29=1,E29*LoadFactor,L29)","v":0},0,{"$f":"IF(OR(J$5=\"Not Entered\",$H$5=0),0,H29/$H$5*$J$5)","v":0},0,{"$f":"HVAC!D15","v":0},0,{"$f":"INDEX('Utility Admin'!$Q$2:$BI$2,1,MATCH(1,('Savings Summary'!$C29='Utility Admin'!$Q$4:$BI$4)*('Savings Summary'!N$7='Utility Admin'!$Q$1:$BI$1),0))","v":{"$error":"#N/A"}},{"$f":"INDEX('Utility Admin'!$Q$2:$BI$2,1,MATCH(1,('Savings Summary'!$C29='Utility Admin'!$Q$4:$BI$4)*('Savings Summary'!O$7='Utility Admin'!$Q$1:$BI$1),0))","v":{"$error":"#N/A"}},{"$f":"INDEX('Utility Admin'!$Q$2:$BI$2,1,MATCH(1,('Savings Summary'!$C29='Utility Admin'!$Q$4:$BI$4)*('Savings Summary'!P$7='Utility Admin'!$Q$1:$BI$1),0))","v":{"$error":"#N/A"}},""]
[null,null,"Condenser Air Evaporative Pre-Cooling",15,{"$f":"HVAC!B23","v":0},0,{"$f":"HVAC!C23","v":0},0,0,0,0,{"$f":"HVAC!D23","v":0},0,{"$f":"INDEX('Utility Admin'!$Q$2:$BI$2,1,MATCH(1,('Savings Summary'!$C30='Utility Admin'!$Q$4:$BI$4)*('Savings Summary'!N$7='Utility Admin'!$Q$1:$BI$1),0))","v":{"$error":"#N/A"}},{"$f":"INDEX('Utility Admin'!$Q$2:$BI$2,1,MATCH(1,('Savings Summary'!$C30='Utility Admin'!$Q$4:$BI$4)*('Savings Summary'!O$7='Utility Admin'!$Q$1:$BI$1),0))","v":{"$error":"#N/A"}},{"$f":"INDEX('Utility Admin'!$Q$2:$BI$2,1,MATCH(1,('Savings Summary'!$C30='Utility Admin'!$Q$4:$BI$4)*('Savings Summary'!P$7='Utility Admin'!$Q$1:$BI$1),0))","v":{"$error":"#N/A"}},""]
[null,null,"Lodging Occupancy Controls",10,{"$f":"HVAC!B29","v":0},0,{"$f":"HVAC!C29","v":0},0,0,0,0,{"$f":"HVAC!D29","v":0},0,{"$f":"INDEX('Utility Admin'!$Q$2:$BI$2,1,MATCH(1,('Savings Summary'!$C31='Utility Admin'!$Q$4:$BI$4)*('Savings Summary'!N$7='Utility Admin'!$Q$1:$BI$1),0))","v":{"$error":"#N/A"}},{"$f":"INDEX('Utility Admin'!$Q$2:$BI$2,1,MATCH(1,('Savings Summary'!$C31='Utility Admin'!$Q$4:$BI$4)*('Savings Summary'!O$7='Utility Admin'!$Q$1:$BI$1),0))","v":{"$error":"#N/A"}},{"$f":"INDEX('Utility Admin'!$Q$2:$BI$2,1,MATCH(1,('Savings Summary'!$C31='Utility Admin'!$Q$4:$BI$4)*('Savings Summary'!P$7='Utility Admin'!$Q$1:$BI$1),0))","v":{"$error":"#N/A"}},""]
[null,null,"Commercial Smart Thermostats",11,{"$f":"HVAC!B35","v":0},0,{"$f":"HVAC!C35","v":0},0,0,0,0,{"$f":"HVAC!D35","v":0},0,{"$f":"INDEX('Utility Admin'!$Q$2:$BI$2,1,MATCH(1,('Savings Summary'!$C32='Utility Admin'!$Q$4:$BI$4)*('Savings Summary'!N$7='Utility Admin'!$Q$1:$BI$1),0))","v":{"$error":"#N/A"}},{"$f":"INDEX('Utility Admin'!$Q$2:$BI$2,1,MATCH(1,('Savings Summary'!$C32='Utility Admin'!$Q$4:$BI$4)*('Savings Summary'!O$7='Utility Admin'!$Q$1:$BI$1),0))","v":{"$error":"#N/A"}},{"$f":"INDEX('Utility Admin'!$Q$2:$BI$2,1,MATCH(1,('Savings Summary'!$C32='Utility Admin'!$Q$4:$BI$4)*('Savings Summary'!P$7='Utility Admin'!$Q$1:$BI$1),0))","v":{"$error":"#N/A"}},""]
[null,null,"High-Volume Low-Speed (HVLS) Fans",9,{"$f":"HVAC!B41","v":0},0,{"$f":"HVAC!C41","v":0},{"$f":"IF(M33=1,E33*LoadFactor,L33)","v":0},0,{"$f":"IF(OR(J$5=\"Not Entered\",$H$5=0),0,H33/$H$5*$J$5)","v":0},0,{"$f":"HVAC!D41","v":0},{"$f":"IF(LoadFactor=\"No\",0,IF(L33>E33*LoadFactor,1,0))","v":0},{"$f":"INDEX('Utility Admin'!$Q$2:$BI$2,1,MATCH(1,('Savings Summary'!$C33='Utility Admin'!$Q$4:$BI$4)*('Savings Summary'!N$7='Utility Admin'!$Q$1:$BI$1),0))","v":{"$error":"#N/A"}},{"$f":"INDEX('Utility Admin'!$Q$2:$BI$2,1,MATCH(1,('Savings Summary'!$C33='Utility Admin'!$Q$4:$BI$4)*('Savings Summary'!O$7='Utility Admin'!$Q$1:$BI$1),0))","v":{"$error":"#N/A"}},{"$f":"INDEX('Utility Admin'!$Q$2:$BI$2,1,MATCH(1,('Savings Summary'!$C33='Utility Admin'!$Q$4:$BI$4)*('Savings Summary'!P$7='Utility Admin'!$Q$1:$BI$1),0))","v":{"$error":"#N/A"}},""]
[null,"Motors","EnergyStar Commercial Pool Pumps",10,{"$f":"Motors!B8","v":0},0,{"$f":"Motors!C8","v":0},0,0,{"$f":"IF(OR(J$5=\"Not Entered\",$H$5=0),0,H34/$H$5*$J$5)","v":0},0,{"$f":"Motors!D8","v":0},0,{"$f":"INDEX('Utility Admin'!$Q$2:$BI$2,1,MATCH(1,('Savings Summary'!$C34='Utility Admin'!$Q$4:$BI$4)*('Savings Summary'!N$7='Utility Admin'!$Q$1:$BI$1),0))","v":{"$error":"#N/A"}},{"$f":"INDEX('Utility Admin'!$Q$2:$BI$2,1,MATCH(1,('Savings Summary'!$C34='Utility Admin'!$Q$4:$BI$4)*('Savings Summary'!O$7='Utility Admin'!$Q$1:$BI$1),0))","v":{"$error":"#N/A"}},{"$f":"INDEX('Utility Admin'!$Q$2:$BI$2,1,MATCH(1,('Savings Summary'!$C34='Utility Admin'!$Q$4:$BI$4)*('Savings Summary'!P$7='Utility Admin'!$Q$1:$BI$1),0))","v":{"$error":"#N/A"}},""]
[null,null,"Premium Efficiency Motors",15,{"$f":"Motors!B16","v":0},0,{"$f":"Motors!C16","v":0},0,0,{"$f":"IF(OR(J$5=\"Not Entered\",$H$5=0),0,H35/$H$5*$J$5)","v":0},0,{"$f":"Motors!D16","v":0},0,{"$f":"INDEX('Utility Admin'!$Q$2:$BI$2,1,MATCH(1,('Savings Summary'!$C35='Utility Admin'!$Q$4:$BI$4)*('Savings Summary'!N$7='Utility Admin'!$Q$1:$BI$1),0))","v":{"$error":"#N/A"}},{"$f":"INDEX('Utility Admin'!$Q$2:$BI$2,1,MATCH(1,('Savings Summary'!$C35='Utility Admin'!$Q$4:$BI$4)*('Savings Summary'!O$7='Utility Admin'!$Q$1:$BI$1),0))","v":{"$error":"#N/A"}},{"$f":"INDEX('Utility Admin'!$Q$2:$BI$2,1,MATCH(1,('Savings Summary'!$C35='Utility Admin'!$Q$4:$BI$4)*('Savings Summary'!P$7='Utility Admin'!$Q$1:$BI$1),0))","v":{"$error":"#N/A"}},""]
[null,null,"Pump Off Controller",15,{"$f":"Motors!B22","v":0},0,{"$f":"Motors!C22","v":0},0,0,{"$f":"IF(OR(J$5=\"Not Entered\",$H$5=0),0,H36/$H$5*$J$5)","v":0},0,{"$f":"Motors!D22","v":0},0,{"$f":"INDEX('Utility Admin'!$Q$2:$BI$2,1,MATCH(1,('Savings Summary'!$C36='Utility Admin'!$Q$4:$BI$4)*('Savings Summary'!N$7='Utility Admin'!$Q$1:$BI$1),0))","v":{"$error":"#N/A"}},{"$f":"INDEX('Utility Admin'!$Q$2:$BI$2,1,MATCH(1,('Savings Summary'!$C36='Utility Admin'!$Q$4:$BI$4)*('Savings Summary'!O$7='Utility Admin'!$Q$1:$BI$1),0))","v":{"$error":"#N/A"}},{"$f":"INDEX('Utility Admin'!$Q$2:$BI$2,1,MATCH(1,('Savings Summary'!$C36='Utility Admin'!$Q$4:$BI$4)*('Savings Summary'!P$7='Utility Admin'!$Q$1:$BI$1),0))","v":{"$error":"#N/A"}},""]
[null,"Miscellaneous","Window Film Treatment",10,{"$f":"Misc!B10","v":0},0,{"$f":"Misc!C10","v":0},0,0,{"$f":"IF(OR(J$5=\"Not Entered\",$H$5=0),0,H37/$H$5*$J$5)","v":0},0,{"$f":"Misc!D10","v":0},0,{"$f":"INDEX('Utility Admin'!$Q$2:$BI$2,1,MATCH(1,('Savings Summary'!$C37='Utility Admin'!$Q$4:$BI$4)*('Savings Summary'!N$7='Utility Admin'!$Q$1:$BI$1),0))","v":{"$error":"#N/A"}},{"$f":"INDEX('Utility Admin'!$Q$2:$BI$2,1,MATCH(1,('Savings Summary'!$C37='Utility Admin'!$Q$4:$BI$4)*('Savings Summary'!O$7='Utility Admin'!$Q$1:$BI$1),0))","v":{"$error":"#N/A"}},{"$f":"INDEX('Utility Admin'!$Q$2:$BI$2,1,MATCH(1,('Savings Summary'!$C37='Utility Admin'!$Q$4:$BI$4)*('Savings Summary'!P$7='Utility Admin'!$Q$1:$BI$1),0))","v":{"$error":"#N/A"}},""]
[null,null,"EnergyStar Roofing",15,{"$f":"Misc!B16","v":0},0,{"$f":"Misc!C16","v":0},0,0,0,0,{"$f":"Misc!D16","v":0},0,{"$f":"INDEX('Utility Admin'!$Q$2:$BI$2,1,MATCH(1,('Savings Summary'!$C38='Utility Admin'!$Q$4:$BI$4)*('Savings Summary'!N$7='Utility Admin'!$Q$1:$BI$1),0))","v":{"$error":"#N/A"}},{"$f":"INDEX('Utility Admin'!$Q$2:$BI$2,1,MATCH(1,('Savings Summary'!$C38='Utility Admin'!$Q$4:$BI$4)*('Savings Summary'!O$7='Utility Admin'!$Q$1:$BI$1),0))","v":{"$error":"#N/A"}},{"$f":"INDEX('Utility Admin'!$Q$2:$BI$2,1,MATCH(1,('Savings Summary'!$C38='Utility Admin'!$Q$4:$BI$4)*('Savings Summary'!P$7='Utility Admin'!$Q$1:$BI$1),0))","v":{"$error":"#N/A"}},""]
[null,null,"Entrance & Exit Door Air Infiltration",11,0,{"$f":"Misc!N22","v":0},{"$f":"Misc!C22","v":0},0,0,0,0,{"$f":"Misc!D22","v":0},0,{"$f":"INDEX('Utility Admin'!$Q$2:$BI$2,1,MATCH(1,('Savings Summary'!$C39='Utility Admin'!$Q$4:$BI$4)*('Savings Summary'!N$7='Utility Admin'!$Q$1:$BI$1),0))","v":{"$error":"#N/A"}},{"$f":"INDEX('Utility Admin'!$Q$2:$BI$2,1,MATCH(1,('Savings Summary'!$C39='Utility Admin'!$Q$4:$BI$4)*('Savings Summary'!O$7='Utility Admin'!$Q$1:$BI$1),0))","v":{"$error":"#N/A"}},{"$f":"INDEX('Utility Admin'!$Q$2:$BI$2,1,MATCH(1,('Savings Summary'!$C39='Utility Admin'!$Q$4:$BI$4)*('Savings Summary'!P$7='Utility Admin'!$Q$1:$BI$1),0))","v":{"$error":"#N/A"}},""]
[null,null,"PC Power Management",3,{"$f":"Misc!B28","v":0},0,{"$f":"Misc!C28","v":0},0,0,0,0,{"$f":"Misc!D28","v":0},0,{"$f":"INDEX('Utility Admin'!$Q$2:$BI$2,1,MATCH(1,('Savings Summary'!$C40='Utility Admin'!$Q$4:$BI$4)*('Savings Summary'!N$7='Utility Admin'!$Q$1:$BI$1),0))","v":{"$error":"#N/A"}},{"$f":"INDEX('Utility Admin'!$Q$2:$BI$2,1,MATCH(1,('Savings Summary'!$C40='Utility Admin'!$Q$4:$BI$4)*('Savings Summary'!O$7='Utility Admin'!$Q$1:$BI$1),0))","v":{"$error":"#N/A"}},{"$f":"INDEX('Utility Admin'!$Q$2:$BI$2,1,MATCH(1,('Savings Summary'!$C40='Utility Admin'!$Q$4:$BI$4)*('Savings Summary'!P$7='Utility Admin'!$Q$1:$BI$1),0))","v":{"$error":"#N/A"}},""]
[null,null,"Central DHW Controls",15,0,{"$f":"Misc!S34","v":0},{"$f":"Misc!C34","v":0},0,0,0,0,{"$f":"Misc!D34","v":0},0,{"$f":"INDEX('Utility Admin'!$Q$2:$BI$2,1,MATCH(1,('Savings Summary'!$C41='Utility Admin'!$Q$4:$BI$4)*('Savings Summary'!N$7='Utility Admin'!$Q$1:$BI$1),0))","v":{"$error":"#N/A"}},{"$f":"INDEX('Utility Admin'!$Q$2:$BI$2,1,MATCH(1,('Savings Summary'!$C41='Utility Admin'!$Q$4:$BI$4)*('Savings Summary'!O$7='Utility Admin'!$Q$1:$BI$1),0))","v":{"$error":"#N/A"}},{"$f":"INDEX('Utility Admin'!$Q$2:$BI$2,1,MATCH(1,('Savings Summary'!$C41='Utility Admin'!$Q$4:$BI$4)*('Savings Summary'!P$7='Utility Admin'!$Q$1:$BI$1),0))","v":{"$error":"#N/A"}},{"$f":"IF(H41<>0,C41&\", \",\"\")","v":""}]
[null,null,null,null,null,null,null,null,null,null,null,null,null,null,null,null,{"$f":"LEFT(_xlfn.CONCAT(Q8:Q41),LEN(_xlfn.CONCAT(Q8:Q41))-2)","v":{"$error":"#VALUE!"}}]
[null,null,null,"Version:",{"$f":"'Project Info'!K1","v":"v20.0"},null,null,"Incentive Cap?",{"$f":"IF('Project Info'!D18=\"\",\"Missing Project Cost\",IF(K5>'Utility Admin'!I2,\"Yes\",\"No\"))","v":"Missing Project Cost"}]
[null,null,null,null,null,null,null,"Load Factor Applied?",{"$f":"IF(SUM(M8:M41)>0,\"Yes\",\"No\")","v":"No"}]
[]
[null,null,null,null,null,null,null,"*Incentive amount is not guaranteed and may be subject to capping based on a percentage of project cost in accordance with program rules."]

{"sheet":"Refrigeration","index":4,"n_rows":75,"n_cols":21,"rows_kept":75,"cut":false,"hidden":true,"merged":[[11,6,14,6],[26,4,26,8],[28,7,29,8],[42,7,47,8]]}
[null,"Refrigeration Measures",null,null,null,null,null,null,null,null,"HIDE","HIDE","HIDE","HIDE","HIDE","HIDE","HIDE","HIDE","HIDE","HIDE","HIDE"]
[null,"Click on headings to expand or collapse sections. Blue Peak kW values indicate winter peak."]
[null,"Door Gaskets"]
[null,"Peak kW","NC kW","kWh","Quantity of Doors","Height (inches)","Width (inches)","Number of Sides","Refrigeration Temperature"]
[null,{"$f":"E5*(2*F5+IF(H5=3,1,IF(H5=4,2,0))*G5)/12*IFERROR(INDEX('Lookup tables'!$G$3:$H$4,MATCH(Refrigeration!I5,'Lookup tables'!$D$3:$D$4,0),MATCH('Utility Admin'!$J$2,'Lookup tables'!$E$1:$F$1,0)),0)","v":0},{"$f":"E5*(2*F5+IF(H5=3,1,IF(H5=4,2,0))*G5)/12*IFERROR(INDEX('Lookup tables'!$I$3:$J$4,MATCH(Refrigeration!I5,'Lookup tables'!$D$3:$D$4,0),MATCH('Utility Admin'!$J$2,'Lookup tables'!$E$1:$F$1,0)),0)","v":0},{"$f":"IFERROR(E5*(2*F5+IF(H5=3,1,IF(H5=4,2,0))*G5)/12*INDEX('Lookup tables'!$E$3:$F$4,MATCH(Refrigeration!I5,'Lookup tables'!$D$3:$D$4,0),MATCH('Utility Admin'!$J$2,'Lookup tables'!$E$1:$F$1,0)),0)","v":0}]
[null,{"$f":"E6*(2*F6+IF(H6=3,1,IF(H6=4,2,0))*G6)/12*IFERROR(INDEX('Lookup tables'!$G$3:$H$4,MATCH(Refrigeration!I6,'Lookup tables'!$D$3:$D$4,0),MATCH('Utility Admin'!$J$2,'Lookup tables'!$E$1:$F$1,0)),0)","v":0},{"$f":"E6*(2*F6+IF(H6=3,1,IF(H6=4,2,0))*G6)/12*IFERROR(INDEX('Lookup tables'!$I$3:$J$4,MATCH(Refrigeration!I6,'Lookup tables'!$D$3:$D$4,0),MATCH('Utility Admin'!$J$2,'Lookup tables'!$E$1:$F$1,0)),0)","v":0},{"$f":"IFERROR(E6*(2*F6+IF(H6=3,1,IF(H6=4,2,0))*G6)/12*INDEX('Lookup tables'!$E$3:$F$4,MATCH(Refrigeration!I6,'Lookup tables'!$D$3:$D$4,0),MATCH('Utility Admin'!$J$2,'Lookup tables'!$E$1:$F$1,0)),0)","v":0}]
[null,{"$f":"E7*(2*F7+IF(H7=3,1,IF(H7=4,2,0))*G7)/12*IFERROR(INDEX('Lookup tables'!$G$3:$H$4,MATCH(Refrigeration!I7,'Lookup tables'!$D$3:$D$4,0),MATCH('Utility Admin'!$J$2,'Lookup tables'!$E$1:$F$1,0)),0)","v":0},{"$f":"E7*(2*F7+IF(H7=3,1,IF(H7=4,2,0))*G7)/12*IFERROR(INDEX('Lookup tables'!$I$3:$J$4,MATCH(Refrigeration!I7,'Lookup tables'!$D$3:$D$4,0),MATCH('Utility Admin'!$J$2,'Lookup tables'!$E$1:$F$1,0)),0)","v":0},{"$f":"IFERROR(E7*(2*F7+IF(H7=3,1,IF(H7=4,2,0))*G7)/12*INDEX('Lookup tables'!$E$3:$F$4,MATCH(Refrigeration!I7,'Lookup tables'!$D$3:$D$4,0),MATCH('Utility Admin'!$J$2,'Lookup tables'!$E$1:$F$1,0)),0)","v":0}]
[null,{"$f":"E8*(2*F8+IF(H8=3,1,IF(H8=4,2,0))*G8)/12*IFERROR(INDEX('Lookup tables'!$G$3:$H$4,MATCH(Refrigeration!I8,'Lookup tables'!$D$3:$D$4,0),MATCH('Utility Admin'!$J$2,'Lookup tables'!$E$1:$F$1,0)),0)","v":0},{"$f":"E8*(2*F8+IF(H8=3,1,IF(H8=4,2,0))*G8)/12*IFERROR(INDEX('Lookup tables'!$I$3:$J$4,MATCH(Refrigeration!I8,'Lookup tables'!$D$3:$D$4,0),MATCH('Utility Admin'!$J$2,'Lookup tables'!$E$1:$F$1,0)),0)","v":0},{"$f":"IFERROR(E8*(2*F8+IF(H8=3,1,IF(H8=4,2,0))*G8)/12*INDEX('Lookup tables'!$E$3:$F$4,MATCH(Refrigeration!I8,'Lookup tables'!$D$3:$D$4,0),MATCH('Utility Admin'!$J$2,'Lookup tables'!$E$1:$F$1,0)),0)","v":0}]
[null,{"$f":"E9*(2*F9+IF(H9=3,1,IF(H9=4,2,0))*G9)/12*IFERROR(INDEX('Lookup tables'!$G$3:$H$4,MATCH(Refrigeration!I9,'Lookup tables'!$D$3:$D$4,0),MATCH('Utility Admin'!$J$2,'Lookup tables'!$E$1:$F$1,0)),0)","v":0},{"$f":"E9*(2*F9+IF(H9=3,1,IF(H9=4,2,0))*G9)/12*IFERROR(INDEX('Lookup tables'!$I$3:$J$4,MATCH(Refrigeration!I9,'Lookup tables'!$D$3:$D$4,0),MATCH('Utility Admin'!$J$2,'Lookup tables'!$E$1:$F$1,0)),0)","v":0},{"$f":"IFERROR(E9*(2*F9+IF(H9=3,1,IF(H9=4,2,0))*G9)/12*INDEX('Lookup tables'!$E$3:$F$4,MATCH(Refrigeration!I9,'Lookup tables'!$D$3:$D$4,0),MATCH('Utility Admin'!$J$2,'Lookup tables'!$E$1:$F$1,0)),0)","v":0}]
[null,{"$f":"SUM(B5:B9)","v":0},{"$f":"SUM(C5:C9)","v":0},{"$f":"SUM(D5:D9)","v":0}]
[null,"Door Heater Controls for Refrigerated Display Cases "]
[null,"Peak kW","NC kW","kWh","Linear Feet (width) of Case*","Refrigeration Temperature","*Quantity is linear feet (width) of the case(s) controlled antisweat heaters. Typical width of a single reach-in refrigerated display case door is »  2.5 ft."]
[null,{"$f":"IFERROR(E13*VLOOKUP(State&SelectedZone,'Lookup tables'!$D$35:$J$40,IF(F13=\"Low Temperature\",6,IF(F13=\"Medium Temperature\",3)),FALSE),0)","v":0},{"$f":"IFERROR(E13*VLOOKUP(State&SelectedZone,'Lookup tables'!$D$35:$J$40,IF(F13=\"Low Temperature\",7,IF(F13=\"Medium Temperature\",4)),FALSE),0)","v":0},{"$f":"IFERROR(E13*INDEX(IF(F13=\"Low Temperature\",'Lookup tables'!$H$35:$H$40,IF(F13=\"Medium Temperature\",'Lookup tables'!$E$35:$E$40)),MATCH(State&SelectedZone,'Lookup tables'!$D$35:$D$40,0)),0)","v":0}]
[null,{"$f":"IFERROR(E14*VLOOKUP(State&SelectedZone,'Lookup tables'!$D$35:$J$40,IF(F14=\"Low Temperature\",6,IF(F14=\"Medium Temperature\",3)),FALSE),0)","v":0},{"$f":"IFERROR(E14*VLOOKUP(State&SelectedZone,'Lookup tables'!$D$35:$J$40,IF(F14=\"Low Temperature\",7,IF(F14=\"Medium Temperature\",4)),FALSE),0)","v":0},{"$f":"IFERROR(E14*INDEX(IF(F14=\"Low Temperature\",'Lookup tables'!$H$35:$H$40,IF(F14=\"Medium Temperature\",'Lookup tables'!$E$35:$E$40)),MATCH(State&SelectedZone,'Lookup tables'!$D$35:$D$40,0)),0)","v":0}]
[null,{"$f":"IFERROR(E15*VLOOKUP(State&SelectedZone,'Lookup tables'!$D$35:$J$40,IF(F15=\"Low Temperature\",6,IF(F15=\"Medium Temperature\",3)),FALSE),0)","v":0},{"$f":"IFERROR(E15*VLOOKUP(State&SelectedZone,'Lookup tables'!$D$35:$J$40,IF(F15=\"Low Temperature\",7,IF(F15=\"Medium Temperature\",4)),FALSE),0)","v":0},{"$f":"IFERROR(E15*INDEX(IF(F15=\"Low Temperature\",'Lookup tables'!$H$35:$H$40,IF(F15=\"Medium Temperature\",'Lookup tables'!$E$35:$E$40)),MATCH(State&SelectedZone,'Lookup tables'!$D$35:$D$40,0)),0)","v":0}]
[null,{"$f":"SUM(B13:B15)","v":0},{"$f":"SUM(C13:C15)","v":0},{"$f":"SUM(D13:D15)","v":0}]
[null,"ECM Evaporator Fan Motors for Refrigerated Display Cases"]
[null,"Peak kW","NC kW","kWh","# of Evaporator Fan Motors","Refrigeration Temperature","Nominal Motor Size","Evaporator Fan Controls?*","Existing Motor Type",null,"COP","Wbase","%off","Hours","DC","LF","DF","NCP DF","Wee","kWperunit","kWhperunit"]
[null,{"$f":"IFERROR(E19*T19*Q19,0)","v":0},{"$f":"IF(OR(E19=\"\",G19=\"\",F19=\"\",H19=\"\"),0,IFERROR(E19*T19*R19,0))","v":0},{"$f":"IFERROR(E19*U19,0)","v":0},null,null,null,null,null,null,{"$f":"INDEX(IF(F19=\"Medium Temperature\",'Lookup tables'!$E$25:$E$30,'Lookup tables'!$F$25:$F$30),MATCH(State&SelectedZone,Locations,0))","v":{"$error":"#N/A"}},{"$f":"INDEX('Lookup tables'!$P$24:$Q$29,MATCH(Refrigeration!G19,'Lookup tables'!$N$24:$N$29,0),MATCH(Refrigeration!I19,'Lookup tables'!$P$23:$Q$23,0))","v":{"$error":"#N/A"}},{"$f":"VLOOKUP(H19,'Lookup tables'!$H$23:$I$24,2,FALSE)","v":{"$error":"#N/A"}},8760,{"$f":"VLOOKUP(F19,'Lookup tables'!$K$27:$L$28,2,FALSE)","v":{"$error":"#N/A"}},0.9,{"$f":"IFERROR(VLOOKUP(State&SelectedZone,'Lookup tables'!$D$25:$G$30,4,FALSE),1)","v":1},{"$f":"NCFr","v":1},{"$f":"VLOOKUP(G19,'Lookup tables'!$N$24:$R$29,5,FALSE)","v":{"$error":"#N/A"}},{"$f":"(L19-S19)/1000*P19*O19*(1+1/K19)","v":{"$error":"#N/A"}},{"$f":"T19*N19*(1-M19)","v":{"$error":"#N/A"}}]
[null,{"$f":"IFERROR(E20*T20*Q20,0)","v":0},0,{"$f":"IFERROR(E20*U20,0)","v":0},null,null,null,null,null,null,{"$f":"INDEX(IF(F20=\"Medium Temperature\",'Lookup tables'!$E$25:$E$30,'Lookup tables'!$F$25:$F$30),MATCH(State&SelectedZone,Locations,0))","v":{"$error":"#N/A"}},{"$f":"INDEX('Lookup tables'!$P$24:$Q$29,MATCH(Refrigeration!G20,'Lookup tables'!$N$24:$N$29,0),MATCH(Refrigeration!I20,'Lookup tables'!$P$23:$Q$23,0))","v":{"$error":"#N/A"}},{"$f":"VLOOKUP(H20,'Lookup tables'!$H$23:$I$24,2,FALSE)","v":{"$error":"#N/A"}},8760,{"$f":"VLOOKUP(F20,'Lookup tables'!$K$27:$L$28,2,FALSE)","v":{"$error":"#N/A"}},0.9,{"$f":"IFERROR(VLOOKUP(State&SelectedZone,'Lookup tables'!$D$25:$G$30,4,FALSE),1)","v":1},1,{"$f":"VLOOKUP(G20,'Lookup tables'!$N$24:$R$29,5,FALSE)","v":{"$error":"#N/A"}},{"$f":"(L20-S20)/1000*P20*O20*(1+1/K20)","v":{"$error":"#N/A"}},{"$f":"T20*N20*(1-M20)","v":{"$error":"#N/A"}}]
[null,0,0,0,null,null,null,null,null,null,{"$f":"INDEX(IF(F21=\"Medium Temperature\",'Lookup tables'!$E$25:$E$30,'Lookup tables'!$F$25:$F$30),MATCH(State&SelectedZone,Locations,0))","v":{"$error":"#N/A"}},{"$f":"INDEX('Lookup tables'!$P$24:$Q$29,MATCH(Refrigeration!G21,'Lookup tables'!$N$24:$N$29,0),MATCH(Refrigeration!I21,'Lookup tables'!$P$23:$Q$23,0))","v":{"$error":"#N/A"}},{"$f":"VLOOKUP(H21,'Lookup tables'!$H$23:$I$24,2,FALSE)","v":{"$error":"#N/A"}},8760,{"$f":"VLOOKUP(F21,'Lookup tables'!$K$27:$L$28,2,FALSE)","v":{"$error":"#N/A"}},0.9,{"$f":"IFERROR(VLOOKUP(State&SelectedZone,'Lookup tables'!$D$25:$G$30,4,FALSE),1)","v":1},1,{"$f":"VLOOKUP(G21,'Lookup tables'!$N$24:$R$29,5,FALSE)","v":{"$error":"#N/A"}},{"$error":"#N/A"},{"$error":"#N/A"}]
[null,0,0,0,null,null,null,null,null,null,{"$f":"INDEX(IF(F22=\"Medium Temperature\",'Lookup tables'!$E$25:$E$30,'Lookup tables'!$F$25:$F$30),MATCH(State&SelectedZone,Locations,0))","v":{"$error":"#N/A"}},{"$f":"INDEX('Lookup tables'!$P$24:$Q$29,MATCH(Refrigeration!G22,'Lookup tables'!$N$24:$N$29,0),MATCH(Refrigeration!I22,'Lookup tables'!$P$23:$Q$23,0))","v":{"$error":"#N/A"}},{"$f":"VLOOKUP(H22,'Lookup tables'!$H$23:$I$24,2,FALSE)","v":{"$error":"#N/A"}},8760,{"$f":"VLOOKUP(F22,'Lookup tables'!$K$27:$L$28,2,FALSE)","v":{"$error":"#N/A"}},0.9,{"$f":"IFERROR(VLOOKUP(State&SelectedZone,'Lookup tables'!$D$25:$G$30,4,FALSE),1)","v":1},1,{"$f":"VLOOKUP(G22,'Lookup tables'!$N$24:$R$29,5,FALSE)","v":{"$error":"#N/A"}},{"$error":"#N/A"},{"$error":"#N/A"}]
[null,0,0,0,null,null,null,null,null,null,{"$f":"INDEX(IF(F23=\"Medium Temperature\",'Lookup tables'!$E$25:$E$30,'Lookup tables'!$F$25:$F$30),MATCH(State&SelectedZone,Locations,0))","v":{"$error":"#N/A"}},{"$f":"INDEX('Lookup tables'!$P$24:$Q$29,MATCH(Refrigeration!G23,'Lookup tables'!$N$24:$N$29,0),MATCH(Refrigeration!I23,'Lookup tables'!$P$23:$Q$23,0))","v":{"$error":"#N/A"}},{"$f":"VLOOKUP(H23,'Lookup tables'!$H$23:$I$24,2,FALSE)","v":{"$error":"#N/A"}},8760,{"$f":"VLOOKUP(F23,'Lookup tables'!$K$27:$L$28,2,FALSE)","v":{"$error":"#N/A"}},0.9,{"$f":"IFERROR(VLOOKUP(State&SelectedZone,'Lookup tables'!$D$25:$G$30,4,FALSE),1)","v":1},1,{"$f":"VLOOKUP(G23,'Lookup tables'!$N$24:$R$29,5,FALSE)","v":{"$error":"#N/A"}},{"$error":"#N/A"},{"$error":"#N/A"}]
[null,0,0,0,null,null,null,null,null,null,{"$f":"INDEX(IF(F24=\"Medium Temperature\",'Lookup tables'!$E$25:$E$30,'Lookup tables'!$F$25:$F$30),MATCH(State&SelectedZone,Locations,0))","v":{"$error":"#N/A"}},{"$f":"INDEX('Lookup tables'!$P$24:$Q$29,MATCH(Refrigeration!G24,'Lookup tables'!$N$24:$N$29,0),MATCH(Refrigeration!I24,'Lookup tables'!$P$23:$Q$23,0))","v":{"$error":"#N/A"}},{"$f":"VLOOKUP(H24,'Lookup tables'!$H$23:$I$24,2,FALSE)","v":{"$error":"#N/A"}},8760,{"$f":"VLOOKUP(F24,'Lookup tables'!$K$27:$L$28,2,FALSE)","v":{"$error":"#N/A"}},0.9,{"$f":"IFERROR(VLOOKUP(State&SelectedZone,'Lookup tables'!$D$25:$G$30,4,FALSE),1)","v":1},1,{"$f":"VLOOKUP(G24,'Lookup tables'!$N$24:$R$29,5,FALSE)","v":{"$error":"#N/A"}},{"$error":"#N/A"},{"$error":"#N/A"}]
[null,0,0,0,null,null,null,null,null,null,{"$f":"INDEX(IF(F25=\"Medium Temperature\",'Lookup tables'!$E$25:$E$30,'Lookup tables'!$F$25:$F$30),MATCH(State&SelectedZone,Locations,0))","v":{"$error":"#N/A"}},{"$f":"INDEX('Lookup tables'!$P$24:$Q$29,MATCH(Refrigeration!G25,'Lookup tables'!$N$24:$N$29,0),MATCH(Refrigeration!I25,'Lookup tables'!$P$23:$Q$23,0))","v":{"$error":"#N/A"}},{"$f":"VLOOKUP(H25,'Lookup tables'!$H$23:$I$24,2,FALSE)","v":{"$error":"#N/A"}},8760,{"$f":"VLOOKUP(F25,'Lookup tables'!$K$27:$L$28,2,FALSE)","v":{"$error":"#N/A"}},0.9,{"$f":"IFERROR(VLOOKUP(State&SelectedZone,'Lookup tables'!$D$25:$G$30,4,FALSE),1)","v":1},1,{"$f":"VLOOKUP(G25,'Lookup tables'!$N$24:$R$29,5,FALSE)","v":{"$error":"#N/A"}},{"$error":"#N/A"},{"$error":"#N/A"}]
[null,0,0,0,null,null,null,null,null,null,{"$f":"INDEX(IF(F26=\"Medium Temperature\",'Lookup tables'!$E$25:$E$30,'Lookup tables'!$F$25:$F$30),MATCH(State&SelectedZone,Locations,0))","v":{"$error":"#N/A"}},{"$f":"INDEX('Lookup tables'!$P$24:$Q$29,MATCH(Refrigeration!G26,'Lookup tables'!$N$24:$N$29,0),MATCH(Refrigeration!I26,'Lookup tables'!$P$23:$Q$23,0))","v":{"$error":"#N/A"}},{"$f":"VLOOKUP(H26,'Lookup tables'!$H$23:$I$24,2,FALSE)","v":{"$error":"#N/A"}},8760,{"$f":"VLOOKUP(F26,'Lookup tables'!$K$27:$L$28,2,FALSE)","v":{"$error":"#N/A"}},0.9,{"$f":"IFERROR(VLOOKUP(State&SelectedZone,'Lookup tables'!$D$25:$G$30,4,FALSE),1)","v":1},1,{"$f":"VLOOKUP(G26,'Lookup tables'!$N$24:$R$29,5,FALSE)","v":{"$error":"#N/A"}},{"$error":"#N/A"},{"$error":"#N/A"}]
[null,{"$f":"SUM(B19:B26)","v":0},{"$f":"SUM(C19:C26)","v":0},{"$f":"SUM(D19:D26)","v":0},"*If adding evaporator fan controls in addition to an ECM upgrade, select \"Yes\" for Evaporator Fan Controls and claim the additional savings through the \"Evaporator Fan Controls\" measure."]
[null,"Electronic Defrost Control"]
[null,"Peak kW","NC kW","kWh","Load of electric defrost (W)","Refrigeration Temperature","Hours per Year Defrost Occurs Without Controls*","*Locate defrost timer. \nHours = frequency(cycles) x duration(min)/60 x 365 "]
[null,{"$f":"IFERROR(D30/G30*VLOOKUP(IF(TRM=\"AR TRM 3\",\"LAMS\",State&SelectedZone),'Lookup tables'!$D$92:$G$98,4,FALSE),0)","v":0},{"$f":"IFERROR(D30/G30,0)","v":0},{"$f":"IFERROR(0.35*E30/1000*G30*(1+0.28*INDEX('Lookup tables'!$E$92:$F$98,MATCH(IF(TRM=\"AR TRM 3\",\"LAMS\",State&SelectedZone),'Lookup tables'!$D$92:$D$98,0),MATCH(F30,'Lookup tables'!$E$89:$F$89,0))),0)","v":0}]
[null,{"$f":"IFERROR(D31/G31*VLOOKUP(IF(TRM=\"AR TRM 3\",\"LAMS\",State&SelectedZone),'Lookup tables'!$D$92:$G$98,4,FALSE),0)","v":0},{"$f":"IFERROR(D31/G31,0)","v":0},{"$f":"IFERROR(0.35*E31/1000*G31*(1+0.28*INDEX('Lookup tables'!$E$92:$F$98,MATCH(IF(TRM=\"AR TRM 3\",\"LAMS\",State&SelectedZone),'Lookup tables'!$D$92:$D$98,0),MATCH(F31,'Lookup tables'!$E$89:$F$89,0))),0)","v":0}]
[null,{"$f":"IFERROR(D32/G32*VLOOKUP(IF(TRM=\"AR TRM 3\",\"LAMS\",State&SelectedZone),'Lookup tables'!$D$92:$G$98,4,FALSE),0)","v":0},{"$f":"IFERROR(D32/G32,0)","v":0},{"$f":"IFERROR(0.35*E32/1000*G32*(1+0.28*INDEX('Lookup tables'!$E$92:$F$98,MATCH(IF(TRM=\"AR TRM 3\",\"LAMS\",State&SelectedZone),'Lookup tables'!$D$92:$D$98,0),MATCH(F32,'Lookup tables'!$E$89:$F$89,0))),0)","v":0}]
[null,{"$f":"IFERROR(D33/G33*VLOOKUP(IF(TRM=\"AR TRM 3\",\"LAMS\",State&SelectedZone),'Lookup tables'!$D$92:$G$98,4,FALSE),0)","v":0},{"$f":"IFERROR(D33/G33,0)","v":0},{"$f":"IFERROR(0.35*E33/1000*G33*(1+0.28*INDEX('Lookup tables'!$E$92:$F$98,MATCH(IF(TRM=\"AR TRM 3\",\"LAMS\",State&SelectedZone),'Lookup tables'!$D$92:$D$98,0),MATCH(F33,'Lookup tables'!$E$89:$F$89,0))),0)","v":0}]
[null,{"$f":"IFERROR(D34/G34*VLOOKUP(IF(TRM=\"AR TRM 3\",\"LAMS\",State&SelectedZone),'Lookup tables'!$D$92:$G$98,4,FALSE),0)","v":0},{"$f":"IFERROR(D34/G34,0)","v":0},{"$f":"IFERROR(0.35*E34/1000*G34*(1+0.28*INDEX('Lookup tables'!$E$92:$F$98,MATCH(IF(TRM=\"AR TRM 3\",\"LAMS\",State&SelectedZone),'Lookup tables'!$D$92:$D$98,0),MATCH(F34,'Lookup tables'!$E$89:$F$89,0))),0)","v":0}]
[null,{"$f":"SUM(B30:B34)","v":0},{"$f":"SUM(C30:C34)","v":0},{"$f":"SUM(D30:D34)","v":0}]
[null,"Evaporator Fan Controls "]
[null,"Peak kW","NC kW","kWh","Number of Evaporator Fans","Refrigeration Temperature"]
[null,{"$f":"IFERROR(IF(E38=\"\",0,(0.123*E38-0.035)*(1-0.5)*VLOOKUP(F38,'Lookup tables'!$D$83:$F$85,2,FALSE)*VLOOKUP(F38,'Lookup tables'!$D$83:$F$85,3,FALSE)*IF(SelectedZone=\"CPS\",CFr,1)),0)","v":0},{"$f":"IFERROR(IF(E38=\"\",0,(0.123*E38-0.035)*(1-0.5)*VLOOKUP(F38,'Lookup tables'!$D$83:$F$85,2,FALSE)*VLOOKUP(F38,'Lookup tables'!$D$83:$F$85,3,FALSE)*NCFr),0)","v":0},{"$f":"IFERROR(IF(E38=\"\",0,(0.123*E38-0.035)*(1-0.5)*VLOOKUP(F38,'Lookup tables'!$D$83:$F$85,2,FALSE)*VLOOKUP(F38,'Lookup tables'!$D$83:$F$85,3,FALSE)*8760),0)","v":0}]
[null,{"$f":"IFERROR(IF(E39=\"\",0,(0.123*E39-0.035)*(1-0.5)*VLOOKUP(F39,'Lookup tables'!$D$83:$F$85,2,FALSE)*VLOOKUP(F39,'Lookup tables'!$D$83:$F$85,3,FALSE)*IF(SelectedZone=\"CPS\",CFr,1)),0)","v":0},{"$f":"IFERROR(IF(E39=\"\",0,(0.123*E39-0.035)*(1-0.5)*VLOOKUP(F39,'Lookup tables'!$D$83:$F$85,2,FALSE)*VLOOKUP(F39,'Lookup tables'!$D$83:$F$85,3,FALSE)*NCFr),0)","v":0},{"$f":"IFERROR(IF(E39=\"\",0,(0.123*E39-0.035)*(1-0.5)*VLOOKUP(F39,'Lookup tables'!$D$83:$F$85,2,FALSE)*VLOOKUP(F39,'Lookup tables'!$D$83:$F$85,3,FALSE)*8760),0)","v":0}]
[null,{"$f":"IFERROR(IF(E40=\"\",0,(0.123*E40-0.035)*(1-0.5)*VLOOKUP(F40,'Lookup tables'!$D$83:$F$85,2,FALSE)*VLOOKUP(F40,'Lookup tables'!$D$83:$F$85,3,FALSE)*IF(SelectedZone=\"CPS\",CFr,1)),0)","v":0},{"$f":"IFERROR(IF(E40=\"\",0,(0.123*E40-0.035)*(1-0.5)*VLOOKUP(F40,'Lookup tables'!$D$83:$F$85,2,FALSE)*VLOOKUP(F40,'Lookup tables'!$D$83:$F$85,3,FALSE)*NCFr),0)","v":0},{"$f":"IFERROR(IF(E40=\"\",0,(0.123*E40-0.035)*(1-0.5)*VLOOKUP(F40,'Lookup tables'!$D$83:$F$85,2,FALSE)*VLOOKUP(F40,'Lookup tables'!$D$83:$F$85,3,FALSE)*8760),0)","v":0}]
[null,{"$f":"SUM(B38:B40)","v":0},{"$f":"SUM(C38:C40)","v":0},{"$f":"SUM(D38:D40)","v":0}]
[null,"Night Covers for Open Vertical and Horizontal Refrigerated Display Cases"]
[null,"Peak kW","NC kW","kWh","Linear Feet (width) of Case*","Refrigeration Temperature","Display Case Orientation","*Quantity is linear feet (width) of the case(s) getting Night Covers installed. Typical width of a single reach-in refrigerated display case door is »  2.5 ft."]
[null,0,{"$f":"IFERROR(VLOOKUP(TRM&\" \"&G44&\" \"&F44&IF(TRM=\"AR TRM 3\",\" \"&H44,\"\"),'Lookup tables'!$D$11:$F$18,2,FALSE)*E44,0)","v":0},{"$f":"IFERROR(VLOOKUP(TRM&\" \"&G44&\" \"&F44&IF(TRM=\"AR TRM 3\",\" \"&H44,\"\"),'Lookup tables'!$D$11:$F$18,3,FALSE)*E44,0)","v":0}]
[null,0,{"$f":"IFERROR(VLOOKUP(TRM&\" \"&G45&\" \"&F45&IF(TRM=\"AR TRM 3\",\" \"&H45,\"\"),'Lookup tables'!$D$11:$F$18,2,FALSE)*E45,0)","v":0},{"$f":"IFERROR(VLOOKUP(TRM&\" \"&G45&\" \"&F45&IF(TRM=\"AR TRM 3\",\" \"&H45,\"\"),'Lookup tables'!$D$11:$F$18,3,FALSE)*E45,0)","v":0}]
[null,0,{"$f":"IFERROR(VLOOKUP(TRM&\" \"&G46&\" \"&F46&IF(TRM=\"AR TRM 3\",\" \"&H46,\"\"),'Lookup tables'!$D$11:$F$18,2,FALSE)*E46,0)","v":0},{"$f":"IFERROR(VLOOKUP(TRM&\" \"&G46&\" \"&F46&IF(TRM=\"AR TRM 3\",\" \"&H46,\"\"),'Lookup tables'!$D$11:$F$18,3,FALSE)*E46,0)","v":0}]
[null,0,{"$f":"IFERROR(VLOOKUP(TRM&\" \"&G47&\" \"&F47&IF(TRM=\"AR TRM 3\",\" \"&H47,\"\"),'Lookup tables'!$D$11:$F$18,2,FALSE)*E47,0)","v":0},{"$f":"IFERROR(VLOOKUP(TRM&\" \"&G47&\" \"&F47&IF(TRM=\"AR TRM 3\",\" \"&H47,\"\"),'Lookup tables'!$D$11:$F$18,3,FALSE)*E47,0)","v":0}]
[null,0,{"$f":"IFERROR(VLOOKUP(TRM&\" \"&G48&\" \"&F48&IF(TRM=\"AR TRM 3\",\" \"&H48,\"\"),'Lookup tables'!$D$11:$F$18,2,FALSE)*E48,0)","v":0},{"$f":"IFERROR(VLOOKUP(TRM&\" \"&G48&\" \"&F48&IF(TRM=\"AR TRM 3\",\" \"&H48,\"\"),'Lookup tables'!$D$11:$F$18,3,FALSE)*E48,0)","v":0}]
[null,{"$f":"SUM(B44:B48)","v":0},{"$f":"SUM(C44:C48)","v":0},{"$f":"SUM(D44:D48)","v":0}]
[null,"Solid & Glass Door Reach-In Refrigerators and Freezers - ENERGY STAR"]
[null,"Peak kW","NC kW","kWh","Number of Cases","Interior Volume (cubic feet)","Refrigeration Temperature","Door Type",null,null,"Interior Volume Range of New Ref/Freezer","key","kWhbase","kWhee","kWh"]
[null,{"$f":"IFERROR(D52/8760*IF(SelectedZone=\"CPS\",CFr,1),0)","v":0},{"$f":"IFERROR(D52/8760*NCFr,0)","v":0},{"$f":"IF(OR(E52=\"\",F52=\"\",G52=\"\"),0,IFERROR(O52,0))","v":0},null,null,null,null,null,null,{"$f":"VLOOKUP(IF(F52<15,1,IF(F52<30,2,IF(F52<50,3,4))),_VolumeRange,2,FALSE)","v":"0 < V < 15 "},{"$f":"G52&H52&K52","v":"0 < V < 15 "},{"$f":"VLOOKUP(L52,_ReachInDoor_kWhee,2,FALSE)*F52+VLOOKUP(L52,_ReachInDoor_kWhee,3,FALSE)","v":{"$error":"#N/A"}},{"$f":"VLOOKUP(L52,_ReachInDoor_kWhee,4,FALSE)*F52+VLOOKUP(L52,_ReachInDoor_kWhee,5,FALSE)","v":{"$error":"#N/A"}},{"$f":"(M52-N52)*365*E52","v":{"$error":"#N/A"}}]
[null,{"$f":"IFERROR(D53/8760*IF(SelectedZone=\"CPS\",CFr,1),0)","v":0},{"$f":"IFERROR(D53/8760*NCFr,0)","v":0},{"$f":"IF(OR(E53=\"\",F53=\"\",G53=\"\"),0,IFERROR(O53,0))","v":0},null,null,null,null,null,null,{"$f":"VLOOKUP(IF(F53<15,1,IF(F53<30,2,IF(F53<50,3,4))),_VolumeRange,2,FALSE)","v":"0 < V < 15 "},{"$f":"G53&H53&K53","v":"0 < V < 15 "},{"$f":"VLOOKUP(L53,_ReachInDoor_kWhee,2,FALSE)*F53+VLOOKUP(L53,_ReachInDoor_kWhee,3,FALSE)","v":{"$error":"#N/A"}},{"$f":"VLOOKUP(L53,_ReachInDoor_kWhee,4,FALSE)*F53+VLOOKUP(L53,_ReachInDoor_kWhee,5,FALSE)","v":{"$error":"#N/A"}},{"$f":"(M53-N53)*365*E53","v":{"$error":"#N/A"}}]
[null,{"$f":"IFERROR(D54/8760*IF(SelectedZone=\"CPS\",CFr,1),0)","v":0},{"$f":"IFERROR(D54/8760*NCFr,0)","v":0},{"$f":"IF(OR(E54=\"\",F54=\"\",G54=\"\"),0,IFERROR(O54,0))","v":0},null,null,null,null,null,null,{"$f":"VLOOKUP(IF(F54<15,1,IF(F54<30,2,IF(F54<50,3,4))),_VolumeRange,2,FALSE)","v":"0 < V < 15 "},{"$f":"G54&H54&K54","v":"0 < V < 15 "},{"$f":"VLOOKUP(L54,_ReachInDoor_kWhee,2,FALSE)*F54+VLOOKUP(L54,_ReachInDoor_kWhee,3,FALSE)","v":{"$error":"#N/A"}},{"$f":"VLOOKUP(L54,_ReachInDoor_kWhee,4,FALSE)*F54+VLOOKUP(L54,_ReachInDoor_kWhee,5,FALSE)","v":{"$error":"#N/A"}},{"$error":"#N/A"}]
[null,{"$f":"IFERROR(D55/8760*IF(SelectedZone=\"CPS\",CFr,1),0)","v":0},{"$f":"IFERROR(D55/8760*NCFr,0)","v":0},{"$f":"IF(OR(E55=\"\",F55=\"\",G55=\"\"),0,IFERROR(O55,0))","v":0},null,null,null,null,null,null,{"$f":"VLOOKUP(IF(F55<15,1,IF(F55<30,2,IF(F55<50,3,4))),_VolumeRange,2,FALSE)","v":"0 < V < 15 "},{"$f":"G55&H55&K55","v":"0 < V < 15 "},{"$f":"VLOOKUP(L55,_ReachInDoor_kWhee,2,FALSE)*F55+VLOOKUP(L55,_ReachInDoor_kWhee,3,FALSE)","v":{"$error":"#N/A"}},{"$f":"VLOOKUP(L55,_ReachInDoor_kWhee,4,FALSE)*F55+VLOOKUP(L55,_ReachInDoor_kWhee,5,FALSE)","v":{"$error":"#N/A"}},{"$error":"#N/A"}]
[null,{"$f":"IFERROR(D56/8760*IF(SelectedZone=\"CPS\",CFr,1),0)","v":0},{"$f":"IFERROR(D56/8760*NCFr,0)","v":0},{"$f":"IF(OR(E56=\"\",F56=\"\",G56=\"\"),0,IFERROR(O56,0))","v":0},null,null,null,null,null,null,{"$f":"VLOOKUP(IF(F56<15,1,IF(F56<30,2,IF(F56<50,3,4))),_VolumeRange,2,FALSE)","v":"0 < V < 15 "},{"$f":"G56&H56&K56","v":"0 < V < 15 "},{"$f":"VLOOKUP(L56,_ReachInDoor_kWhee,2,FALSE)*F56+VLOOKUP(L56,_ReachInDoor_kWhee,3,FALSE)","v":{"$error":"#N/A"}},{"$f":"VLOOKUP(L56,_ReachInDoor_kWhee,4,FALSE)*F56+VLOOKUP(L56,_ReachInDoor_kWhee,5,FALSE)","v":{"$error":"#N/A"}},{"$error":"#N/A"}]
[null,{"$f":"SUM(B52:B56)","v":0},{"$f":"SUM(C52:C56)","v":0},{"$f":"SUM(D52:D56)","v":0}]
[null,"Strip Curtains for Walk-In Refrigerated Storage"]
[null,"Peak kW","NC kW","kWh","Number of Doorways","Refrigeration Temperature"]
[null,{"$f":"IFERROR(INDEX('Lookup tables'!$E$101:$G$112,MATCH(State&SelectedZone&Refrigeration!$F60,'Lookup tables'!$D$101:$D$112,0),MATCH(Refrigeration!B$59,'Lookup tables'!$E$100:$G$100,0))*$E60,0)","v":0},{"$f":"IFERROR(INDEX('Lookup tables'!$E$101:$G$112,MATCH(State&SelectedZone&Refrigeration!$F60,'Lookup tables'!$D$101:$D$112,0),MATCH(Refrigeration!C$59,'Lookup tables'!$E$100:$G$100,0))*$E60,0)","v":0},{"$f":"IFERROR(INDEX('Lookup tables'!$E$101:$G$112,MATCH(State&SelectedZone&Refrigeration!$F60,'Lookup tables'!$D$101:$D$112,0),MATCH(Refrigeration!D$59,'Lookup tables'!$E$100:$G$100,0))*$E60,0)","v":0}]
[null,{"$f":"IFERROR(INDEX('Lookup tables'!$E$101:$G$112,MATCH(State&SelectedZone&Refrigeration!$F61,'Lookup tables'!$D$101:$D$112,0),MATCH(Refrigeration!B$59,'Lookup tables'!$E$100:$G$100,0))*$E61,0)","v":0},{"$f":"IFERROR(INDEX('Lookup tables'!$E$101:$G$112,MATCH(State&SelectedZone&Refrigeration!$F61,'Lookup tables'!$D$101:$D$112,0),MATCH(Refrigeration!C$59,'Lookup tables'!$E$100:$G$100,0))*$E61,0)","v":0},{"$f":"IFERROR(INDEX('Lookup tables'!$E$101:$G$112,MATCH(State&SelectedZone&Refrigeration!$F61,'Lookup tables'!$D$101:$D$112,0),MATCH(Refrigeration!D$59,'Lookup tables'!$E$100:$G$100,0))*$E61,0)","v":0}]
[null,{"$f":"IFERROR(INDEX('Lookup tables'!$E$101:$G$112,MATCH(State&SelectedZone&Refrigeration!$F62,'Lookup tables'!$D$101:$D$112,0),MATCH(Refrigeration!B$59,'Lookup tables'!$E$100:$G$100,0))*$E62,0)","v":0},{"$f":"IFERROR(INDEX('Lookup tables'!$E$101:$G$112,MATCH(State&SelectedZone&Refrigeration!$F62,'Lookup tables'!$D$101:$D$112,0),MATCH(Refrigeration!C$59,'Lookup tables'!$E$100:$G$100,0))*$E62,0)","v":0},{"$f":"IFERROR(INDEX('Lookup tables'!$E$101:$G$112,MATCH(State&SelectedZone&Refrigeration!$F62,'Lookup tables'!$D$101:$D$112,0),MATCH(Refrigeration!D$59,'Lookup tables'!$E$100:$G$100,0))*$E62,0)","v":0}]
[null,{"$f":"SUM(B60:B62)","v":0},{"$f":"SUM(C60:C62)","v":0},{"$f":"SUM(D60:D62)","v":0}]
[null,"Vending Machine Controls"]
[null,"Peak kW","NC kW","kWh","Number of Machines","Types of Machine"]
[null,{"$f":"IFERROR(VLOOKUP(F66,'Lookup tables'!$D$180:$F$182,3,FALSE)*E66,0)","v":0},{"$f":"IFERROR(VLOOKUP(F66,'Lookup tables'!$D$180:$G$182,4,FALSE)*E66,0)","v":0},{"$f":"IFERROR(VLOOKUP(F66,'Lookup tables'!$D$180:$F$182,2,FALSE)*E66,0)","v":0}]
[null,{"$f":"IFERROR(VLOOKUP(F67,'Lookup tables'!$D$180:$F$182,3,FALSE)*E67,0)","v":0},{"$f":"IFERROR(VLOOKUP(F67,'Lookup tables'!$D$180:$G$182,4,FALSE)*E67,0)","v":0},{"$f":"IFERROR(VLOOKUP(F67,'Lookup tables'!$D$180:$F$182,2,FALSE)*E67,0)","v":0}]
[null,{"$f":"IFERROR(VLOOKUP(F68,'Lookup tables'!$D$180:$F$182,3,FALSE)*E68,0)","v":0},{"$f":"IFERROR(VLOOKUP(F68,'Lookup tables'!$D$180:$G$182,4,FALSE)*E68,0)","v":0},{"$f":"IFERROR(VLOOKUP(F68,'Lookup tables'!$D$180:$F$182,2,FALSE)*E68,0)","v":0}]
[null,{"$f":"SUM(B66:B68)","v":0},{"$f":"SUM(C66:C68)","v":0},{"$f":"SUM(D66:D68)","v":0}]
[null,"Zero-Energy Doors for Refrigerated Cases"]
[null,"Peak kW","NC kW","kWh","Length of Case (ft)","Refrigeration Temperature","This measure cannot be used in conjunction with anti-sweat heat (ASH) controls."]
[null,{"$f":"IFERROR(E72*INDEX('Lookup tables'!$E$69:$G$81,MATCH(IF(TRM=\"AR TRM 3\",\"LAMS\",State&SelectedZone)&Refrigeration!$F72,'Lookup tables'!$D$69:$D$81,0),MATCH(Refrigeration!B$71,'Lookup tables'!$E$68:$G$68,0)),0)","v":0},{"$f":"IFERROR(E72*INDEX('Lookup tables'!$E$69:$G$80,MATCH(State&SelectedZone&Refrigeration!$F72,'Lookup tables'!$D$69:$D$80,0),MATCH(Refrigeration!C$71,'Lookup tables'!$E$68:$G$68,0)),0)","v":0},{"$f":"IFERROR(E72*INDEX('Lookup tables'!$E$69:$G$80,MATCH(IF(TRM=\"AR TRM 3\",\"LAMS\",State&SelectedZone)&Refrigeration!$F72,'Lookup tables'!$D$69:$D$80,0),MATCH(Refrigeration!D$71,'Lookup tables'!$E$68:$G$68,0)),0)","v":0}]
[null,{"$f":"IFERROR(E73*INDEX('Lookup tables'!$E$69:$G$81,MATCH(IF(TRM=\"AR TRM 3\",\"LAMS\",State&SelectedZone)&Refrigeration!$F73,'Lookup tables'!$D$69:$D$81,0),MATCH(Refrigeration!B$71,'Lookup tables'!$E$68:$G$68,0)),0)","v":0},{"$f":"IFERROR(E73*INDEX('Lookup tables'!$E$69:$G$80,MATCH(State&SelectedZone&Refrigeration!$F73,'Lookup tables'!$D$69:$D$80,0),MATCH(Refrigeration!C$71,'Lookup tables'!$E$68:$G$68,0)),0)","v":0},{"$f":"IFERROR(E73*INDEX('Lookup tables'!$E$69:$G$80,MATCH(IF(TRM=\"AR TRM 3\",\"LAMS\",State&SelectedZone)&Refrigeration!$F73,'Lookup tables'!$D$69:$D$80,0),MATCH(Refrigeration!D$71,'Lookup tables'!$E$68:$G$68,0)),0)","v":0}]
[null,{"$f":"IFERROR(E74*INDEX('Lookup tables'!$E$69:$G$81,MATCH(IF(TRM=\"AR TRM 3\",\"LAMS\",State&SelectedZone)&Refrigeration!$F74,'Lookup tables'!$D$69:$D$81,0),MATCH(Refrigeration!B$71,'Lookup tables'!$E$68:$G$68,0)),0)","v":0},{"$f":"IFERROR(E74*INDEX('Lookup tables'!$E$69:$G$80,MATCH(State&SelectedZone&Refrigeration!$F74,'Lookup tables'!$D$69:$D$80,0),MATCH(Refrigeration!C$71,'Lookup tables'!$E$68:$G$68,0)),0)","v":0},{"$f":"IFERROR(E74*INDEX('Lookup tables'!$E$69:$G$80,MATCH(IF(TRM=\"AR TRM 3\",\"LAMS\",State&SelectedZone)&Refrigeration!$F74,'Lookup tables'!$D$69:$D$80,0),MATCH(Refrigeration!D$71,'Lookup tables'!$E$68:$G$68,0)),0)","v":0}]
[null,{"$f":"SUM(B72:B74)","v":0},{"$f":"SUM(C72:C74)","v":0},{"$f":"SUM(D72:D74)","v":0}]

{"sheet":"Food Service","index":5,"n_rows":83,"n_cols":23,"rows_kept":83,"cut":false,"hidden":true,"merged":[[73,2,73,9],[74,2,75,9],[76,2,77,9],[78,2,79,9],[80,2,81,9],[76,1,77,1],[74,1,75,1],[80,1,81,1],[78,1,79,1],[82,2,82,9],[64,12,65,12],[64,13,65,13],[64,14,65,14],[15,6,15,7],[16,6,16,7],[17,6,17,7],[18,6,18,7],[45,6,45,7],[46,6,46,7],[47,6,47,7],[48,6,48,7],[51,6,51,7],[52,6,52,7],[53,6,53,7],[54,6,54,7]]}
[null,"Commercial Food Service Measures",null,null,null,null,null,null,null,null,null,null,"HIDE","HIDE","HIDE","HIDE","HIDE","HIDE","HIDE","HIDE","HIDE","HIDE","HIDE"]
[null,"Click on headings to expand or collapse sections. Blue Peak kW values indicate winter peak."]
[null,"ENERGY STAR Electric Convection Oven"]
[null,"Peak kW","NC kW","kWh","Number of Ovens","Oven Size"]
[null,{"$f":"IFERROR(VLOOKUP(F5,'Lookup tables'!$D$115:$K$116,3,FALSE)*E5,0)","v":0},{"$f":"IFERROR(VLOOKUP(F5,'Lookup tables'!$D$115:$K$116,4,FALSE)*E5,0)","v":0},{"$f":"IFERROR(VLOOKUP(F5,'Lookup tables'!$D$115:$K$116,2,FALSE)*E5,0)","v":0}]
[null,{"$f":"IFERROR(VLOOKUP(F6,'Lookup tables'!$D$115:$K$116,3,FALSE)*E6,0)","v":0},{"$f":"IFERROR(VLOOKUP(F6,'Lookup tables'!$D$115:$K$116,4,FALSE)*E6,0)","v":0},{"$f":"IFERROR(VLOOKUP(F6,'Lookup tables'!$D$115:$K$116,2,FALSE)*E6,0)","v":0}]
[null,{"$f":"IFERROR(VLOOKUP(F7,'Lookup tables'!$D$115:$K$116,3,FALSE)*E7,0)","v":0},{"$f":"IFERROR(VLOOKUP(F7,'Lookup tables'!$D$115:$K$116,4,FALSE)*E7,0)","v":0},{"$f":"IFERROR(VLOOKUP(F7,'Lookup tables'!$D$115:$K$116,2,FALSE)*E7,0)","v":0}]
[null,{"$f":"SUM(B5:B7)","v":0},{"$f":"SUM(C5:C7)","v":0},{"$f":"SUM(D5:D7)","v":0}]
[null,"ENERGY STAR Combination Oven"]
[null,"Peak kW","NC kW","kWh","Number of Ovens"]
[null,{"$f":"IFERROR($E11*INDEX('Lookup tables'!F$120:F$121,MATCH(TRM,'Lookup tables'!D$120:D$121,0)),0)","v":0},{"$f":"IFERROR($E11*INDEX('Lookup tables'!G$120:G$121,MATCH(TRM,'Lookup tables'!D$120:D$121,0)),0)","v":0},{"$f":"IFERROR(E11*INDEX('Lookup tables'!E$120:E$121,MATCH(TRM,'Lookup tables'!D$120:D$121,0)),0)","v":0}]
[null,{"$f":"IFERROR($E12*INDEX('Lookup tables'!F$120:F$121,MATCH(TRM,'Lookup tables'!D$120:D$121,0)),0)","v":0},{"$f":"IFERROR($E12*INDEX('Lookup tables'!G$120:G$121,MATCH(TRM,'Lookup tables'!D$120:D$121,0)),0)","v":0},{"$f":"IFERROR(E12*INDEX('Lookup tables'!E$120:E$121,MATCH(TRM,'Lookup tables'!D$120:D$121,0)),0)","v":0}]
[null,{"$f":"IFERROR($E13*INDEX('Lookup tables'!F$120:F$121,MATCH(TRM,'Lookup tables'!D$120:D$121,0)),0)","v":0},{"$f":"IFERROR($E13*INDEX('Lookup tables'!G$120:G$121,MATCH(TRM,'Lookup tables'!D$120:D$121,0)),0)","v":0},{"$f":"IFERROR(E13*INDEX('Lookup tables'!E$120:E$121,MATCH(TRM,'Lookup tables'!D$120:D$121,0)),0)","v":0}]
[null,{"$f":"SUM(B11:B13)","v":0},{"$f":"SUM(C11:C13)","v":0},{"$f":"SUM(D11:D13)","v":0}]
[null,"ENERGY STAR Dishwashers",null,null,null,null,null,null,null,"Click for dishwasher type descriptions"]
[null,"Peak kW","NC kW","kWh","Number of Dishwashers","Dishwasher Type","Dishwasher Temperature/Supply"]
[null,{"$f":"IFERROR($E17*INDEX('Lookup tables'!$E$128:$S$130,MATCH('Food Service'!$G17,'Lookup tables'!$D$128:$D$130,0),MATCH('Food Service'!$F17&'Food Service'!B$16,'Lookup tables'!$E$127:$R$127,0)),0)","v":0},{"$f":"IFERROR($E17*INDEX('Lookup tables'!$E$128:$S$130,MATCH('Food Service'!$G17,'Lookup tables'!$D$128:$D$130,0),MATCH('Food Service'!$F17&'Food Service'!C$16,'Lookup tables'!$E$127:$R$127,0)),0)","v":0},{"$f":"IFERROR($E17*INDEX('Lookup tables'!$E$128:$R$130,MATCH('Food Service'!$G17,'Lookup tables'!$D$128:$D$130,0),MATCH('Food Service'!$F17&'Food Service'!D$16,'Lookup tables'!$E$127:$R$127,0)),0)","v":0}]
[null,{"$f":"IFERROR($E18*INDEX('Lookup tables'!$E$128:$S$130,MATCH('Food Service'!$G18,'Lookup tables'!$D$128:$D$130,0),MATCH('Food Service'!$F18&'Food Service'!B$16,'Lookup tables'!$E$127:$R$127,0)),0)","v":0},{"$f":"IFERROR($E18*INDEX('Lookup tables'!$E$128:$S$130,MATCH('Food Service'!$G18,'Lookup tables'!$D$128:$D$130,0),MATCH('Food Service'!$F18&'Food Service'!C$16,'Lookup tables'!$E$127:$R$127,0)),0)","v":0},{"$f":"IFERROR($E18*INDEX('Lookup tables'!$E$128:$R$130,MATCH('Food Service'!$G18,'Lookup tables'!$D$128:$D$130,0),MATCH('Food Service'!$F18&'Food Service'!D$16,'Lookup tables'!$E$127:$R$127,0)),0)","v":0}]
[null,{"$f":"IFERROR($E19*INDEX('Lookup tables'!$E$128:$S$130,MATCH('Food Service'!$G19,'Lookup tables'!$D$128:$D$130,0),MATCH('Food Service'!$F19&'Food Service'!B$16,'Lookup tables'!$E$127:$R$127,0)),0)","v":0},{"$f":"IFERROR($E19*INDEX('Lookup tables'!$E$128:$S$130,MATCH('Food Service'!$G19,'Lookup tables'!$D$128:$D$130,0),MATCH('Food Service'!$F19&'Food Service'!C$16,'Lookup tables'!$E$127:$R$127,0)),0)","v":0},{"$f":"IFERROR($E19*INDEX('Lookup tables'!$E$128:$R$130,MATCH('Food Service'!$G19,'Lookup tables'!$D$128:$D$130,0),MATCH('Food Service'!$F19&'Food Service'!D$16,'Lookup tables'!$E$127:$R$127,0)),0)","v":0}]
[null,{"$f":"SUM(B17:B19)","v":0},{"$f":"SUM(C17:C19)","v":0},{"$f":"SUM(D17:D19)","v":0}]
[null,"ENERGY STAR Electric Steam Cookers"]
[null,"Peak kW","NC kW","kWh","Number of Cookers","Number of Pans per Cooker","Steam Cooker Type"]
[null,{"$f":"IFERROR(INDEX('Lookup tables'!E148:G163,MATCH(TRM&G23&F23,'Lookup tables'!D148:D163,0),MATCH($B$22,'Lookup tables'!$E$147:$G$147,0))*E23,0)","v":0},{"$f":"IFERROR(INDEX('Lookup tables'!E148:G163,MATCH(TRM&G23&F23,'Lookup tables'!D148:D163,0),MATCH($C$22,'Lookup tables'!$E$147:$G$147,0))*E23,0)","v":0},{"$f":"IFERROR(INDEX('Lookup tables'!E148:G163,MATCH(TRM&G23&F23,'Lookup tables'!D148:D163,0),MATCH($D$22,'Lookup tables'!$E$147:$G$147,0))*E23,0)","v":0}]
[null,{"$f":"IFERROR(INDEX('Lookup tables'!E149:G164,MATCH(TRM&G24&F24,'Lookup tables'!D149:D164,0),MATCH($B$22,'Lookup tables'!$E$147:$G$147,0))*E24,0)","v":0},{"$f":"IFERROR(INDEX('Lookup tables'!E149:G164,MATCH(TRM&G24&F24,'Lookup tables'!D149:D164,0),MATCH($C$22,'Lookup tables'!$E$147:$G$147,0))*E24,0)","v":0},{"$f":"IFERROR(INDEX('Lookup tables'!E149:G164,MATCH(TRM&G24&F24,'Lookup tables'!D149:D164,0),MATCH($D$22,'Lookup tables'!$E$147:$G$147,0))*E24,0)","v":0}]
[null,{"$f":"IFERROR(INDEX('Lookup tables'!E150:G165,MATCH(TRM&G25&F25,'Lookup tables'!D150:D165,0),MATCH($B$22,'Lookup tables'!$E$147:$G$147,0))*E25,0)","v":0},{"$f":"IFERROR(INDEX('Lookup tables'!E150:G165,MATCH(TRM&G25&F25,'Lookup tables'!D150:D165,0),MATCH($C$22,'Lookup tables'!$E$147:$G$147,0))*E25,0)","v":0},{"$f":"IFERROR(INDEX('Lookup tables'!E150:G165,MATCH(TRM&G25&F25,'Lookup tables'!D150:D165,0),MATCH($D$22,'Lookup tables'!$E$147:$G$147,0))*E25,0)","v":0}]
[null,{"$f":"SUM(B23:B25)","v":0},{"$f":"SUM(C23:C25)","v":0},{"$f":"SUM(D23:D25)","v":0}]
[null,"ENERGY STAR Electric Fryers"]
[null,"Peak kW","NC kW","kWh","Number of Fryers","Fryer Type"]
[null,{"$f":"IFERROR(INDEX('Lookup tables'!$E$175:$G$176,MATCH($F29,'Lookup tables'!$D$175:$D$176,0),2),0)*$E29","v":0},{"$f":"IFERROR(INDEX('Lookup tables'!$E$175:$G$176,MATCH($F29,'Lookup tables'!$D$175:$D$176,0),3),0)*$E29","v":0},{"$f":"IFERROR(INDEX('Lookup tables'!$E$175:$G$176,MATCH($F29,'Lookup tables'!$D$175:$D$176,0),1)*E29,0)","v":0}]
[null,{"$f":"IFERROR(INDEX('Lookup tables'!$E$175:$G$176,MATCH($F30,'Lookup tables'!$D$175:$D$176,0),2),0)*$E30","v":0},{"$f":"IFERROR(INDEX('Lookup tables'!$E$175:$G$176,MATCH($F30,'Lookup tables'!$D$175:$D$176,0),3),0)*$E30","v":0},{"$f":"IFERROR(INDEX('Lookup tables'!$E$175:$G$176,MATCH($F30,'Lookup tables'!$D$175:$D$176,0),1)*E30,0)","v":0}]
[null,{"$f":"IFERROR(INDEX('Lookup tables'!$E$175:$G$176,MATCH($F31,'Lookup tables'!$D$175:$D$176,0),2),0)*$E31","v":0},{"$f":"IFERROR(INDEX('Lookup tables'!$E$175:$G$176,MATCH($F31,'Lookup tables'!$D$175:$D$176,0),3),0)*$E31","v":0},{"$f":"IFERROR(INDEX('Lookup tables'!$E$175:$G$176,MATCH($F31,'Lookup tables'!$D$175:$D$176,0),1)*E31,0)","v":0}]
[null,{"$f":"SUM(B29:B31)","v":0},0,0]
[null,"ENERGY STAR Electric Hot Food Holding Cabinet"]
[null,"Peak kW","NC kW","kWh","Number of Cabinets","Cabinet Size"]
[null,{"$f":"IFERROR(INDEX('Lookup tables'!$E$169:$G$171,MATCH($F35,'Lookup tables'!$D$169:$D$171,0),2),0)*$E35","v":0},{"$f":"IFERROR(INDEX('Lookup tables'!$E$169:$G$171,MATCH($F35,'Lookup tables'!$D$169:$D$171,0),3),0)*$E35","v":0},{"$f":"IFERROR(INDEX('Lookup tables'!$E$169:$G$171,MATCH($F35,'Lookup tables'!$D$169:$D$171,0),1)*E35,0)","v":0}]
[null,{"$f":"IFERROR(INDEX('Lookup tables'!$E$169:$G$171,MATCH($F36,'Lookup tables'!$D$169:$D$171,0),2),0)*$E36","v":0},{"$f":"IFERROR(INDEX('Lookup tables'!$E$169:$G$171,MATCH($F36,'Lookup tables'!$D$169:$D$171,0),3),0)*$E36","v":0},{"$f":"IFERROR(INDEX('Lookup tables'!$E$169:$G$171,MATCH($F36,'Lookup tables'!$D$169:$D$171,0),1)*E36,0)","v":0}]
[null,{"$f":"IFERROR(INDEX('Lookup tables'!$E$169:$G$171,MATCH($F37,'Lookup tables'!$D$169:$D$171,0),2),0)*$E37","v":0},{"$f":"IFERROR(INDEX('Lookup tables'!$E$169:$G$171,MATCH($F37,'Lookup tables'!$D$169:$D$171,0),3),0)*$E37","v":0},{"$f":"IFERROR(INDEX('Lookup tables'!$E$169:$G$171,MATCH($F37,'Lookup tables'!$D$169:$D$171,0),1)*E37,0)","v":0}]
[null,{"$f":"SUM(B35:B37)","v":0},{"$f":"SUM(C35:C37)","v":0},{"$f":"SUM(D35:D37)","v":0}]
[null,"Low Flow Pre-Rinse Spray Valve Electric (direct install/point of sale)"]
[null,"Peak kW","NC kW","kWh","Quantity (#)","Building Type"]
[null,{"$f":"$E41*IFERROR(INDEX('Lookup tables'!$E$187:$G$191,MATCH('Food Service'!$F41,SprayValveBldg,0),2),0)","v":0},{"$f":"$E41*IFERROR(INDEX('Lookup tables'!$E$187:$G$191,MATCH('Food Service'!$F41,SprayValveBldg,0),3),0)","v":0},{"$f":"IFERROR(INDEX('Lookup tables'!$E$187:$G$191,MATCH('Food Service'!$F41,SprayValveBldg,0),1)*E41,0)","v":0},null,null,null,null,null,null,1,1]
[null,{"$f":"$E42*IFERROR(INDEX('Lookup tables'!$E$187:$G$191,MATCH('Food Service'!$F42,SprayValveBldg,0),2),0)","v":0},{"$f":"$E42*IFERROR(INDEX('Lookup tables'!$E$187:$G$191,MATCH('Food Service'!$F42,SprayValveBldg,0),3),0)","v":0},{"$f":"IFERROR(INDEX('Lookup tables'!$E$187:$G$191,MATCH('Food Service'!$F42,SprayValveBldg,0),1)*E42,0)","v":0}]
[null,{"$f":"$E43*IFERROR(INDEX('Lookup tables'!$E$187:$G$191,MATCH('Food Service'!$F43,SprayValveBldg,0),2),0)","v":0},{"$f":"$E43*IFERROR(INDEX('Lookup tables'!$E$187:$G$191,MATCH('Food Service'!$F43,SprayValveBldg,0),3),0)","v":0},{"$f":"IFERROR(INDEX('Lookup tables'!$E$187:$G$191,MATCH('Food Service'!$F43,SprayValveBldg,0),1)*E43,0)","v":0}]
[null,{"$f":"SUM(B41:B43)","v":0},0,0]
[null,"Low Flow Faucet Aerator"]
[null,"Peak kW","NC kW","kWh","Quantity (#)","Building Type","Water Heater Type",null,"Installed Flow Rate (gpm)*",null,null,null,"U","Days","P","WHEff","TS","kWh"]
[null,{"$f":"IF(OR(E47=\"\",F47=\"\",G47=\"\",I47=\"\"),0,E47*IFERROR(8.33*M47*(2.2-I47)*(105-Q47)*O47/P47/3412,0))","v":0},{"$f":"B47","v":0},{"$f":"IF(OR(E47=\"\",F47=\"\",G47=\"\",I47=\"\"),0,IFERROR(R47,0))","v":0},null,null,null,null,null,null,null,null,{"$f":"INDEX('Lookup tables'!E$199:E$205,MATCH('Food Service'!$F47,'Lookup tables'!$D$199:$D$205,0))","v":{"$error":"#N/A"}},{"$f":"INDEX('Lookup tables'!F$199:F$205,MATCH('Food Service'!$F47,'Lookup tables'!$D$199:$D$205,0))","v":{"$error":"#N/A"}},{"$f":"INDEX('Lookup tables'!G$199:G$205,MATCH('Food Service'!$F47,'Lookup tables'!$D$199:$D$205,0))","v":{"$error":"#N/A"}},{"$f":"VLOOKUP(G47,'Lookup tables'!$D$195:$E$196,2,FALSE)","v":{"$error":"#N/A"}},{"$f":"'Lookup tables'!$F$195","v":{"$error":"#N/A"}},{"$f":"E47*8.33*M47*(2.2-I47)*(105-Q47)*N47/P47/3412","v":{"$error":"#N/A"}}]
[null,{"$f":"IF(OR(E48=\"\",F48=\"\",G48=\"\",I48=\"\"),0,E48*IFERROR(8.33*M48*(2.2-I48)*(105-Q48)*O48/P48/3412,0))","v":0},{"$f":"B48","v":0},{"$f":"IF(OR(E48=\"\",F48=\"\",G48=\"\",I48=\"\"),0,IFERROR(R48,0))","v":0},null,null,null,null,null,null,null,null,{"$f":"INDEX('Lookup tables'!E$199:E$205,MATCH('Food Service'!$F48,'Lookup tables'!$D$199:$D$205,0))","v":{"$error":"#N/A"}},{"$f":"INDEX('Lookup tables'!F$199:F$205,MATCH('Food Service'!$F48,'Lookup tables'!$D$199:$D$205,0))","v":{"$error":"#N/A"}},{"$f":"INDEX('Lookup tables'!G$199:G$205,MATCH('Food Service'!$F48,'Lookup tables'!$D$199:$D$205,0))","v":{"$error":"#N/A"}},{"$f":"VLOOKUP(G48,'Lookup tables'!$D$195:$E$196,2,FALSE)","v":{"$error":"#N/A"}},{"$f":"'Lookup tables'!$F$195","v":{"$error":"#N/A"}},{"$f":"E48*8.33*M48*(2.2-I48)*(105-Q48)*N48/P48/3412","v":{"$error":"#N/A"}}]
[null,{"$f":"IF(OR(E49=\"\",F49=\"\",G49=\"\",I49=\"\"),0,E49*IFERROR(8.33*M49*(2.2-I49)*(105-Q49)*O49/P49/3412,0))","v":0},{"$f":"B49","v":0},{"$f":"IF(OR(E49=\"\",F49=\"\",G49=\"\",I49=\"\"),0,IFERROR(R49,0))","v":0},null,null,null,null,null,null,null,null,{"$f":"INDEX('Lookup tables'!E$199:E$205,MATCH('Food Service'!$F49,'Lookup tables'!$D$199:$D$205,0))","v":{"$error":"#N/A"}},{"$f":"INDEX('Lookup tables'!F$199:F$205,MATCH('Food Service'!$F49,'Lookup tables'!$D$199:$D$205,0))","v":{"$error":"#N/A"}},{"$f":"INDEX('Lookup tables'!G$199:G$205,MATCH('Food Service'!$F49,'Lookup tables'!$D$199:$D$205,0))","v":{"$error":"#N/A"}},{"$f":"VLOOKUP(G49,'Lookup tables'!$D$195:$E$196,2,FALSE)","v":{"$error":"#N/A"}},{"$f":"'Lookup tables'!$F$195","v":{"$error":"#N/A"}},{"$f":"E49*8.33*M49*(2.2-I49)*(105-Q49)*N49/P49/3412","v":{"$error":"#N/A"}}]
[null,{"$f":"SUM(B47:B49)","v":0},0,0,null,null,null,null,"*1.5GPM maximum"]
[null,"Low Flow Showerhead"]
[null,"Peak kW","NC kW","kWh","Quantity (#)","Building Type","Water Heater Type",null,"Installed Flow Rate (gpm)*",null,null,null,"Days","N","P","WHEff","TS","FHW","kWh"]
[null,{"$f":"IF(COUNTA(E53:I53)<4,0,E53*IFERROR(8.33*7.8*N53*(2.5-I53)*R53*(120-Q53)*O53/P53/3412,0))","v":0},{"$f":"B53","v":0},{"$f":"IF(COUNTA(E53:I53)<4,0,IFERROR(S53,0))","v":0},null,null,null,null,null,null,null,null,{"$f":"INDEX('Lookup tables'!E$208:E$212,MATCH('Food Service'!$F53,'Lookup tables'!$D$208:$D$212,0))","v":{"$error":"#N/A"}},{"$f":"INDEX('Lookup tables'!F$208:F$212,MATCH('Food Service'!$F53,'Lookup tables'!$D$208:$D$212,0))","v":{"$error":"#N/A"}},{"$f":"INDEX('Lookup tables'!G$208:G$212,MATCH('Food Service'!$F53,'Lookup tables'!$D$208:$D$212,0))","v":{"$error":"#N/A"}},{"$f":"VLOOKUP(G53,'Lookup tables'!$D$195:$E$196,2,FALSE)","v":{"$error":"#N/A"}},{"$f":"'Lookup tables'!$F$195","v":{"$error":"#N/A"}},{"$f":"'Lookup tables'!$I$209","v":{"$error":"#N/A"}},{"$f":"E53*8.33*7.8*N53*(2.5-I53)*R53*(120-Q53)*M53/P53/3412","v":{"$error":"#N/A"}}]
[null,{"$f":"IF(COUNTA(E54:I54)<4,0,E54*IFERROR(8.33*7.8*N54*(2.5-I54)*R54*(120-Q54)*O54/P54/3412,0))","v":0},{"$f":"B54","v":0},{"$f":"IF(COUNTA(E54:I54)<4,0,IFERROR(S54,0))","v":0},null,null,null,null,null,null,null,null,{"$f":"INDEX('Lookup tables'!E$208:E$212,MATCH('Food Service'!$F54,'Lookup tables'!$D$208:$D$212,0))","v":{"$error":"#N/A"}},{"$f":"INDEX('Lookup tables'!F$208:F$212,MATCH('Food Service'!$F54,'Lookup tables'!$D$208:$D$212,0))","v":{"$error":"#N/A"}},{"$f":"INDEX('Lookup tables'!G$208:G$212,MATCH('Food Service'!$F54,'Lookup tables'!$D$208:$D$212,0))","v":{"$error":"#N/A"}},{"$f":"VLOOKUP(G54,'Lookup tables'!$D$195:$E$196,2,FALSE)","v":{"$error":"#N/A"}},{"$f":"'Lookup tables'!$F$195","v":{"$error":"#N/A"}},{"$f":"'Lookup tables'!$I$209","v":{"$error":"#N/A"}},{"$f":"E54*8.33*7.8*N54*(2.5-I54)*R54*(120-Q54)*M54/P54/3412","v":{"$error":"#N/A"}}]
[null,0,{"$f":"B55","v":0},0,null,null,null,null,null,null,null,null,{"$f":"INDEX('Lookup tables'!E$208:E$212,MATCH('Food Service'!$F55,'Lookup tables'!$D$208:$D$212,0))","v":{"$error":"#N/A"}},{"$f":"INDEX('Lookup tables'!F$208:F$212,MATCH('Food Service'!$F55,'Lookup tables'!$D$208:$D$212,0))","v":{"$error":"#N/A"}},{"$f":"INDEX('Lookup tables'!G$208:G$212,MATCH('Food Service'!$F55,'Lookup tables'!$D$208:$D$212,0))","v":{"$error":"#N/A"}},{"$f":"VLOOKUP(G55,'Lookup tables'!$D$195:$E$196,2,FALSE)","v":{"$error":"#N/A"}},{"$f":"'Lookup tables'!$F$195","v":{"$error":"#N/A"}},{"$f":"'Lookup tables'!$I$209","v":{"$error":"#N/A"}},{"$f":"E55*8.33*7.8*N55*(2.5-I55)*R55*(120-Q55)*M55/P55/3412","v":{"$error":"#N/A"}}]
[null,{"$f":"SUM(B53:B55)","v":0},0,0,null,null,null,null,"*2GPM maximum"]
[null,"Demand Controlled Kitchen Ventilation"]
[null,"Peak kW","NCP kW","kWh","Quantity (#)","Building Type","Exhaust Fan HP","Dedicated Make-Up Air Unit (MAU)?","HVAC Heating Type","Outdoor Air Supply CFM",null,null,"AvgSav kWh/HP","Hrs/Day","Day/Yr","MAUf","Heat Savings","Cool Savings","PWPLS_S","PWPLS_W","kWh","kW_S","kW_W"]
[null,{"$f":"MAX(V59:W59)","v":0},{"$f":"B59","v":0},{"$f":"U59","v":0},null,null,null,null,null,null,null,null,{"$f":"INDEX('Lookup tables'!I$217:I$240,MATCH(1,(State&SelectedZone='Lookup tables'!$D$217:$D$240)*('Food Service'!$F59='Lookup tables'!$E$217:$E$240),0))","v":{"$error":"#N/A"}},{"$f":"INDEX('Lookup tables'!J$217:J$240,MATCH(1,(State&SelectedZone='Lookup tables'!$D$217:$D$240)*('Food Service'!$F59='Lookup tables'!$E$217:$E$240),0))","v":{"$error":"#N/A"}},{"$f":"INDEX('Lookup tables'!K$217:K$240,MATCH(1,(State&SelectedZone='Lookup tables'!$D$217:$D$240)*('Food Service'!$F59='Lookup tables'!$E$217:$E$240),0))","v":{"$error":"#N/A"}},{"$f":"IF(H59=\"Yes\",1,INDEX('Lookup tables'!L$217:L$240,MATCH(1,(State&SelectedZone='Lookup tables'!$D$217:$D$240)*('Food Service'!$F59='Lookup tables'!$E$217:$E$240),0)))","v":{"$error":"#N/A"}},{"$f":"INDEX(IF(I59=\"Electric Resistance\",'Lookup tables'!F$217:F$240,'Lookup tables'!G$217:G$240),MATCH(1,(State&SelectedZone='Lookup tables'!$D$217:$D$240)*('Food Service'!$F59='Lookup tables'!$E$217:$E$240),0))","v":{"$error":"#N/A"}},{"$f":"INDEX('Lookup tables'!H$217:H$240,MATCH(1,(State&SelectedZone='Lookup tables'!$D$217:$D$240)*('Food Service'!$F59='Lookup tables'!$E$217:$E$240),0))","v":{"$error":"#N/A"}},{"$f":"INDEX('Lookup tables'!M$217:M$240,MATCH(1,(State&SelectedZone='Lookup tables'!$D$217:$D$240)*('Food Service'!$F59='Lookup tables'!$E$217:$E$240),0))","v":{"$error":"#N/A"}},{"$f":"INDEX('Lookup tables'!N$217:N$240,MATCH(1,(State&SelectedZone='Lookup tables'!$D$217:$D$240)*('Food Service'!$F59='Lookup tables'!$E$217:$E$240),0))","v":{"$error":"#N/A"}},{"$f":"IF(COUNTA(E59:J59)<6,0,E59*(M59*G59*N59*O59*P59+(Q59+R59)*J59/1000))","v":0},{"$f":"IFERROR(U59*S59,0)","v":0},{"$f":"IFERROR(U59*T59,0)","v":0}]
[null,{"$f":"MAX(V60:W60)","v":0},{"$f":"B60","v":0},{"$f":"U60","v":0},null,null,null,null,null,null,null,null,{"$f":"INDEX('Lookup tables'!I$217:I$240,MATCH(1,(State&SelectedZone='Lookup tables'!$D$217:$D$240)*('Food Service'!$F60='Lookup tables'!$E$217:$E$240),0))","v":{"$error":"#N/A"}},{"$f":"INDEX('Lookup tables'!J$217:J$240,MATCH(1,(State&SelectedZone='Lookup tables'!$D$217:$D$240)*('Food Service'!$F60='Lookup tables'!$E$217:$E$240),0))","v":{"$error":"#N/A"}},{"$f":"INDEX('Lookup tables'!K$217:K$240,MATCH(1,(State&SelectedZone='Lookup tables'!$D$217:$D$240)*('Food Service'!$F60='Lookup tables'!$E$217:$E$240),0))","v":{"$error":"#N/A"}},{"$f":"IF(H60=\"Yes\",1,INDEX('Lookup tables'!L$217:L$240,MATCH(1,(State&SelectedZone='Lookup tables'!$D$217:$D$240)*('Food Service'!$F60='Lookup tables'!$E$217:$E$240),0)))","v":{"$error":"#N/A"}},{"$f":"INDEX(IF(I60=\"Electric Resistance\",'Lookup tables'!F$217:F$240,'Lookup tables'!G$217:G$240),MATCH(1,(State&SelectedZone='Lookup tables'!$D$217:$D$240)*('Food Service'!$F60='Lookup tables'!$E$217:$E$240),0))","v":{"$error":"#N/A"}},{"$f":"INDEX('Lookup tables'!H$217:H$240,MATCH(1,(State&SelectedZone='Lookup tables'!$D$217:$D$240)*('Food Service'!$F60='Lookup tables'!$E$217:$E$240),0))","v":{"$error":"#N/A"}},{"$f":"INDEX('Lookup tables'!M$217:M$240,MATCH(1,(State&SelectedZone='Lookup tables'!$D$217:$D$240)*('Food Service'!$F60='Lookup tables'!$E$217:$E$240),0))","v":{"$error":"#N/A"}},{"$f":"INDEX('Lookup tables'!N$217:N$240,MATCH(1,(State&SelectedZone='Lookup tables'!$D$217:$D$240)*('Food Service'!$F60='Lookup tables'!$E$217:$E$240),0))","v":{"$error":"#N/A"}},{"$f":"IF(COUNTA(E60:J60)<6,0,E60*(M60*G60*N60*O60*P60+(Q60+R60)*J60/1000))","v":0},{"$f":"IFERROR(U60*S60,0)","v":0},{"$f":"IFERROR(U60*T60,0)","v":0}]
[null,0,{"$f":"B61","v":0},{"$f":"U61","v":0},null,null,null,null,null,null,null,null,{"$f":"INDEX('Lookup tables'!I$217:I$240,MATCH(1,(State&SelectedZone='Lookup tables'!$D$217:$D$240)*('Food Service'!$F61='Lookup tables'!$E$217:$E$240),0))","v":{"$error":"#N/A"}},{"$f":"INDEX('Lookup tables'!J$217:J$240,MATCH(1,(State&SelectedZone='Lookup tables'!$D$217:$D$240)*('Food Service'!$F61='Lookup tables'!$E$217:$E$240),0))","v":{"$error":"#N/A"}},{"$f":"INDEX('Lookup tables'!K$217:K$240,MATCH(1,(State&SelectedZone='Lookup tables'!$D$217:$D$240)*('Food Service'!$F61='Lookup tables'!$E$217:$E$240),0))","v":{"$error":"#N/A"}},{"$f":"IF(H61=\"Yes\",1,INDEX('Lookup tables'!L$217:L$240,MATCH(1,(State&SelectedZone='Lookup tables'!$D$217:$D$240)*('Food Service'!$F61='Lookup tables'!$E$217:$E$240),0)))","v":{"$error":"#N/A"}},{"$f":"INDEX(IF(I61=\"Electric Resistance\",'Lookup tables'!F$217:F$240,'Lookup tables'!G$217:G$240),MATCH(1,(State&SelectedZone='Lookup tables'!$D$217:$D$240)*('Food Service'!$F61='Lookup tables'!$E$217:$E$240),0))","v":{"$error":"#N/A"}},{"$f":"INDEX('Lookup tables'!H$217:H$240,MATCH(1,(State&SelectedZone='Lookup tables'!$D$217:$D$240)*('Food Service'!$F61='Lookup tables'!$E$217:$E$240),0))","v":{"$error":"#N/A"}},{"$f":"INDEX('Lookup tables'!M$217:M$240,MATCH(1,(State&SelectedZone='Lookup tables'!$D$217:$D$240)*('Food Service'!$F61='Lookup tables'!$E$217:$E$240),0))","v":{"$error":"#N/A"}},{"$f":"INDEX('Lookup tables'!N$217:N$240,MATCH(1,(State&SelectedZone='Lookup tables'!$D$217:$D$240)*('Food Service'!$F61='Lookup tables'!$E$217:$E$240),0))","v":{"$error":"#N/A"}},{"$f":"IF(COUNTA(E61:J61)<6,0,E61*(M61*G61*N61*O61*P61+(Q61+R61)*J61/1000))","v":0},{"$f":"IFERROR(U61*S61,0)","v":0},{"$f":"IFERROR(U61*T61,0)","v":0}]
[null,0,0,0,null,null,null,null,null,null,null,null,{"$f":"INDEX('Lookup tables'!I$217:I$240,MATCH(1,(State&SelectedZone='Lookup tables'!$D$217:$D$240)*('Food Service'!$F62='Lookup tables'!$E$217:$E$240),0))","v":{"$error":"#N/A"}},{"$f":"INDEX('Lookup tables'!J$217:J$240,MATCH(1,(State&SelectedZone='Lookup tables'!$D$217:$D$240)*('Food Service'!$F62='Lookup tables'!$E$217:$E$240),0))","v":{"$error":"#N/A"}},{"$f":"INDEX('Lookup tables'!K$217:K$240,MATCH(1,(State&SelectedZone='Lookup tables'!$D$217:$D$240)*('Food Service'!$F62='Lookup tables'!$E$217:$E$240),0))","v":{"$error":"#N/A"}},{"$f":"IF(H62=\"Yes\",1,INDEX('Lookup tables'!L$217:L$240,MATCH(1,(State&SelectedZone='Lookup tables'!$D$217:$D$240)*('Food Service'!$F62='Lookup tables'!$E$217:$E$240),0)))","v":{"$error":"#N/A"}},{"$f":"INDEX(IF(I62=\"Electric Resistance\",'Lookup tables'!F$217:F$240,'Lookup tables'!G$217:G$240),MATCH(1,(State&SelectedZone='Lookup tables'!$D$217:$D$240)*('Food Service'!$F62='Lookup tables'!$E$217:$E$240),0))","v":{"$error":"#N/A"}},{"$f":"INDEX('Lookup tables'!H$217:H$240,MATCH(1,(State&SelectedZone='Lookup tables'!$D$217:$D$240)*('Food Service'!$F62='Lookup tables'!$E$217:$E$240),0))","v":{"$error":"#N/A"}},{"$f":"INDEX('Lookup tables'!M$217:M$240,MATCH(1,(State&SelectedZone='Lookup tables'!$D$217:$D$240)*('Food Service'!$F62='Lookup tables'!$E$217:$E$240),0))","v":{"$error":"#N/A"}},{"$f":"INDEX('Lookup tables'!N$217:N$240,MATCH(1,(State&SelectedZone='Lookup tables'!$D$217:$D$240)*('Food Service'!$F62='Lookup tables'!$E$217:$E$240),0))","v":{"$error":"#N/A"}},0,0,0]
[null,0,{"$f":"B63","v":0},0,null,null,null,null,null,null,null,null,{"$f":"INDEX('Lookup tables'!I$217:I$240,MATCH(1,(State&SelectedZone='Lookup tables'!$D$217:$D$240)*('Food Service'!$F63='Lookup tables'!$E$217:$E$240),0))","v":{"$error":"#N/A"}},{"$f":"INDEX('Lookup tables'!J$217:J$240,MATCH(1,(State&SelectedZone='Lookup tables'!$D$217:$D$240)*('Food Service'!$F63='Lookup tables'!$E$217:$E$240),0))","v":{"$error":"#N/A"}},{"$f":"INDEX('Lookup tables'!K$217:K$240,MATCH(1,(State&SelectedZone='Lookup tables'!$D$217:$D$240)*('Food Service'!$F63='Lookup tables'!$E$217:$E$240),0))","v":{"$error":"#N/A"}},{"$f":"IF(H63=\"Yes\",1,INDEX('Lookup tables'!L$217:L$240,MATCH(1,(State&SelectedZone='Lookup tables'!$D$217:$D$240)*('Food Service'!$F63='Lookup tables'!$E$217:$E$240),0)))","v":{"$error":"#N/A"}},{"$f":"INDEX(IF(I63=\"Electric Resistance\",'Lookup tables'!F$217:F$240,'Lookup tables'!G$217:G$240),MATCH(1,(State&SelectedZone='Lookup tables'!$D$217:$D$240)*('Food Service'!$F63='Lookup tables'!$E$217:$E$240),0))","v":{"$error":"#N/A"}},{"$f":"INDEX('Lookup tables'!H$217:H$240,MATCH(1,(State&SelectedZone='Lookup tables'!$D$217:$D$240)*('Food Service'!$F63='Lookup tables'!$E$217:$E$240),0))","v":{"$error":"#N/A"}},{"$f":"INDEX('Lookup tables'!M$217:M$240,MATCH(1,(State&SelectedZone='Lookup tables'!$D$217:$D$240)*('Food Service'!$F63='Lookup tables'!$E$217:$E$240),0))","v":{"$error":"#N/A"}},{"$f":"INDEX('Lookup tables'!N$217:N$240,MATCH(1,(State&SelectedZone='Lookup tables'!$D$217:$D$240)*('Food Service'!$F63='Lookup tables'!$E$217:$E$240),0))","v":{"$error":"#N/A"}},0,0,0]
[null,{"$f":"SUM(B59:B63)","v":0},{"$f":"SUM(C59:C63)","v":0},0,null,null,null,null,null,null,null,null,null,null,null,null,null,null,null,null,null,{"$f":"SUM(V59:V63)","v":0},{"$f":"SUM(W59:W63)","v":0}]
[null,"Commercial Ice Makers",null,null,null,null,null,null,null,null,null,null,"Base Energy Use Const","Base Energy Use Mult","Use Rate Base (kWh/100 lb ice)"]
[null,"Peak kW","NCP kW","kWh","Quantity (#)","Type","Operation","Harvest Rate (lbs/day)","Energy Use (kWh/100 lbs ice)",null,null,null,null,null,null,"Duty Cycle","Days","PLS","kWh","kW"]
[null,{"$f":"T67","v":0},{"$f":"B67","v":0},{"$f":"S67","v":0},null,null,null,null,null,null,null,null,{"$f":"INDEX(INDIRECT(SUBSTITUTE(F67&G67&\"BaseEnergyUse\",\" \",\"\")),MATCH(H67,INDIRECT(SUBSTITUTE(F67&G67&\"HarvestRange\",\" \",\"\")),1),1)","v":{"$error":"#REF!"}},{"$f":"INDEX(INDIRECT(SUBSTITUTE(F67&G67&\"BaseEnergyUse\",\" \",\"\")),MATCH(H67,INDIRECT(SUBSTITUTE(F67&G67&\"HarvestRange\",\" \",\"\")),1),2)","v":{"$error":"#REF!"}},{"$f":"M67+H67*N67","v":{"$error":"#REF!"}},0.8,365,1.2E-4,{"$f":"IF(COUNTA(E67:I67)<5,0,E67*(O67-I67)*H67/100*P67*Q67)","v":0},{"$f":"S67*R67","v":0}]
[null,{"$f":"T68","v":0},{"$f":"B68","v":0},{"$f":"S68","v":0},null,null,null,null,null,null,null,null,{"$f":"INDEX(INDIRECT(SUBSTITUTE(F68&G68&\"BaseEnergyUse\",\" \",\"\")),MATCH(H68,INDIRECT(SUBSTITUTE(F68&G68&\"HarvestRange\",\" \",\"\")),1),1)","v":{"$error":"#REF!"}},{"$f":"INDEX(INDIRECT(SUBSTITUTE(F68&G68&\"BaseEnergyUse\",\" \",\"\")),MATCH(H68,INDIRECT(SUBSTITUTE(F68&G68&\"HarvestRange\",\" \",\"\")),1),2)","v":{"$error":"#REF!"}},{"$f":"M68+H68*N68","v":{"$error":"#REF!"}},0.8,365,1.2E-4,{"$f":"IF(COUNTA(E68:I68)<5,0,E68*(O68-I68)*H68/100*P68*Q68)","v":0},{"$f":"S68*R68","v":0}]
[null,{"$f":"T69","v":0},0,{"$f":"S69","v":0},null,null,null,null,null,null,null,null,{"$f":"INDEX(INDIRECT(SUBSTITUTE(F69&G69&\"BaseEnergyUse\",\" \",\"\")),MATCH(H69,INDIRECT(SUBSTITUTE(F69&G69&\"HarvestRange\",\" \",\"\")),1),1)","v":{"$error":"#REF!"}},{"$f":"INDEX(INDIRECT(SUBSTITUTE(F69&G69&\"BaseEnergyUse\",\" \",\"\")),MATCH(H69,INDIRECT(SUBSTITUTE(F69&G69&\"HarvestRange\",\" \",\"\")),1),2)","v":{"$error":"#REF!"}},{"$f":"M69+H69*N69","v":{"$error":"#REF!"}},0.8,365,1.2E-4,{"$f":"IF(COUNTA(E69:I69)<5,0,E69*(O69-I69)*H69/100*P69*Q69)","v":0},{"$f":"S69*R69","v":0}]
[null,0,0,0,null,null,null,null,null,null,null,null,{"$error":"#REF!"},{"$error":"#REF!"},{"$error":"#REF!"},0.8,365,1.2E-4,0,0]
[null,0,0,0,null,null,null,null,null,null,null,null,{"$error":"#REF!"},{"$error":"#REF!"},{"$error":"#REF!"},0.8,365,1.2E-4,0,0]
[null,{"$f":"SUM(B67:B71)","v":0},{"$f":"SUM(C67:C71)","v":0},0]
[]
[null,"Dishwasher Type","Equipment Description"]
[null,"Under Counter Dishwasher","A machine with overall height of 38\" or less, in which a rack of dishes remains stationary within the machine while being subjected to sequential wash and rinse sprays, and is designed to be installed under food preparation workspaces.  Under counter dishwashers can be either chemical or hot water sanitizing, with an internal booster heater for the latter.  For purposes of this specification, only those machines designed for wash cycles of 10 minutes or less can qualify for ENERGY STAR®."]
[]
[null,"Stationary Rack, Single Tank, Door Type Dishwasher","A machine in which a rack of dishes remains stationary within the machine while subjected to sequential wash and rinse sprays.  This definition also applies to machines in which the rack revolves on an axis during the wash and rinse cycles.  Subcategories of stationary door type machines include:  single and multiple wash tank, double rack, pot, pan and utensil washers, chemical dump type and hooded wash compartment (\"hood type\").  Stationary rack, single tank, door type models are covered by this specification and can be either chemical or hot water sanitizing, with an internal or external booster heater for the latter."]
[]
[null,"Single Tank Conveyor Dishwasher","A washing machine that employs a conveyor or similar mechanism to carry dishes through a series of wash and rinse sprays within the machine.  Specifically, a single tank conveyor machine has a tank for wash water followed by a final sanitizing rinse and does not have a pumped rinse tank. This type of machine may include a pre-washing section before the washing section.  Single tank conveyor dishwashers can either be chemical or hot water sanitizing, with an internal or external booster heater for the latter."]
[]
[null,"Multiple Tank Conveyor Dishwasher","A conveyor type machine that has one or more tanks for wash water and one or more tanks for pumped rinse water, followed by a final sanitizing rinse.  This type of machine may include one more pre-washing sections before the washing section.  Multiple tank conveyor dishwashers can be either chemical or hot water sanitizing, with an internal or external hot water booster heater for the latter."]
[]
[null,"Pot, Pan, and Utensil","A stationary rack, door type machine designed to clean and sanitize pots, pans, and kitchen utensils."]

{"sheet":"HVAC","index":6,"n_rows":41,"n_cols":21,"rows_kept":41,"cut":false,"hidden":true,"merged":[[29,13,30,13],[29,15,30,15],[34,7,34,9],[14,5,14,6],[22,7,22,9],[29,12,30,12]]}
[null,"HVAC Measures",null,null,null,null,null,null,null,null,null,"HIDE","HIDE","HIDE","HIDE","HIDE","HIDE","HIDE","HIDE","HIDE","HIDE"]
[null,"Click on headings to expand or collapse sections. Blue Peak kW values indicate winter peak."]
[null,"HVAC Variable Frequency Drives (VFD's)"]
[null,"Peak kW","NCP kW","kWh","Quantity","Application","Building Type","Motor Size (HP)","Existing Control Type\n(AHU Supply Fans Only)",null,null,"kWh/HP","kW/HP Summer","kW/HP Winter"]
[null,{"$f":"E5*H5*MAX(M5,N5)","v":0},{"$f":"B5","v":0},{"$f":"E5*H5*L5","v":0},null,null,null,null,null,null,null,{"$f":"IFERROR(INDEX(VFDSavingsTable,MATCH(1,(State&SelectedZone='Lookup tables'!$D$265:$D$300)*(HVAC!F5='Lookup tables'!$E$265:$E$300)*(HVAC!I5='Lookup tables'!$F$265:$F$300),0),MATCH(1,(HVAC!G5='Lookup tables'!$G$263:$V$263)*(\"kWh\"='Lookup tables'!$G$264:$V$264),0)),0)","v":0},{"$f":"IF(F5=\"Hot Water Pump\",0,IFERROR(INDEX(VFDSavingsTable,MATCH(1,(State&SelectedZone='Lookup tables'!$D$265:$D$300)*(HVAC!F5='Lookup tables'!$E$265:$E$300)*(HVAC!I5='Lookup tables'!$F$265:$F$300),0),MATCH(1,(HVAC!G5='Lookup tables'!$G$263:$V$263)*(\"kW\"='Lookup tables'!$G$264:$V$264),0)),0))","v":0},{"$f":"IF(F5=\"Hot Water Pump\",IFERROR(INDEX(VFDSavingsTable,MATCH(1,(State&SelectedZone='Lookup tables'!$D$265:$D$300)*(HVAC!F5='Lookup tables'!$E$265:$E$300)*(HVAC!I5='Lookup tables'!$F$265:$F$300),0),MATCH(1,(HVAC!G5='Lookup tables'!$G$263:$V$263)*(\"kW\"='Lookup tables'!$G$264:$V$264),0)),0),0)","v":0}]
[null,0,{"$f":"B6","v":0},{"$f":"E6*H6*L6","v":0},null,null,null,null,null,null,null,{"$f":"IFERROR(INDEX(VFDSavingsTable,MATCH(1,(State&SelectedZone='Lookup tables'!$D$265:$D$300)*(HVAC!F6='Lookup tables'!$E$265:$E$300)*(HVAC!I6='Lookup tables'!$F$265:$F$300),0),MATCH(1,(HVAC!G6='Lookup tables'!$G$263:$V$263)*(\"kWh\"='Lookup tables'!$G$264:$V$264),0)),0)","v":0},{"$f":"IF(F6=\"Hot Water Pump\",0,IFERROR(INDEX(VFDSavingsTable,MATCH(1,(State&SelectedZone='Lookup tables'!$D$265:$D$300)*(HVAC!F6='Lookup tables'!$E$265:$E$300)*(HVAC!I6='Lookup tables'!$F$265:$F$300),0),MATCH(1,(HVAC!G6='Lookup tables'!$G$263:$V$263)*(\"kW\"='Lookup tables'!$G$264:$V$264),0)),0))","v":0},{"$f":"IF(F6=\"Hot Water Pump\",IFERROR(INDEX(VFDSavingsTable,MATCH(1,(State&SelectedZone='Lookup tables'!$D$265:$D$300)*(HVAC!F6='Lookup tables'!$E$265:$E$300)*(HVAC!I6='Lookup tables'!$F$265:$F$300),0),MATCH(1,(HVAC!G6='Lookup tables'!$G$263:$V$263)*(\"kW\"='Lookup tables'!$G$264:$V$264),0)),0),0)","v":0}]
[null,0,0,0,null,null,null,null,null,null,null,{"$f":"IFERROR(INDEX(VFDSavingsTable,MATCH(1,(State&SelectedZone='Lookup tables'!$D$265:$D$300)*(HVAC!F7='Lookup tables'!$E$265:$E$300)*(HVAC!I7='Lookup tables'!$F$265:$F$300),0),MATCH(1,(HVAC!G7='Lookup tables'!$G$263:$V$263)*(\"kWh\"='Lookup tables'!$G$264:$V$264),0)),0)","v":0},{"$f":"IF(F7=\"Hot Water Pump\",0,IFERROR(INDEX(VFDSavingsTable,MATCH(1,(State&SelectedZone='Lookup tables'!$D$265:$D$300)*(HVAC!F7='Lookup tables'!$E$265:$E$300)*(HVAC!I7='Lookup tables'!$F$265:$F$300),0),MATCH(1,(HVAC!G7='Lookup tables'!$G$263:$V$263)*(\"kW\"='Lookup tables'!$G$264:$V$264),0)),0))","v":0},{"$f":"IF(F7=\"Hot Water Pump\",IFERROR(INDEX(VFDSavingsTable,MATCH(1,(State&SelectedZone='Lookup tables'!$D$265:$D$300)*(HVAC!F7='Lookup tables'!$E$265:$E$300)*(HVAC!I7='Lookup tables'!$F$265:$F$300),0),MATCH(1,(HVAC!G7='Lookup tables'!$G$263:$V$263)*(\"kW\"='Lookup tables'!$G$264:$V$264),0)),0),0)","v":0}]
[null,0,0,0,null,null,null,null,null,null,null,{"$f":"IFERROR(INDEX(VFDSavingsTable,MATCH(1,(State&SelectedZone='Lookup tables'!$D$265:$D$300)*(HVAC!F8='Lookup tables'!$E$265:$E$300)*(HVAC!I8='Lookup tables'!$F$265:$F$300),0),MATCH(1,(HVAC!G8='Lookup tables'!$G$263:$V$263)*(\"kWh\"='Lookup tables'!$G$264:$V$264),0)),0)","v":0},{"$f":"IF(F8=\"Hot Water Pump\",0,IFERROR(INDEX(VFDSavingsTable,MATCH(1,(State&SelectedZone='Lookup tables'!$D$265:$D$300)*(HVAC!F8='Lookup tables'!$E$265:$E$300)*(HVAC!I8='Lookup tables'!$F$265:$F$300),0),MATCH(1,(HVAC!G8='Lookup tables'!$G$263:$V$263)*(\"kW\"='Lookup tables'!$G$264:$V$264),0)),0))","v":0},{"$f":"IF(F8=\"Hot Water Pump\",IFERROR(INDEX(VFDSavingsTable,MATCH(1,(State&SelectedZone='Lookup tables'!$D$265:$D$300)*(HVAC!F8='Lookup tables'!$E$265:$E$300)*(HVAC!I8='Lookup tables'!$F$265:$F$300),0),MATCH(1,(HVAC!G8='Lookup tables'!$G$263:$V$263)*(\"kW\"='Lookup tables'!$G$264:$V$264),0)),0),0)","v":0}]
[null,0,0,0,null,null,null,null,null,null,null,{"$f":"IFERROR(INDEX(VFDSavingsTable,MATCH(1,(State&SelectedZone='Lookup tables'!$D$265:$D$300)*(HVAC!F9='Lookup tables'!$E$265:$E$300)*(HVAC!I9='Lookup tables'!$F$265:$F$300),0),MATCH(1,(HVAC!G9='Lookup tables'!$G$263:$V$263)*(\"kWh\"='Lookup tables'!$G$264:$V$264),0)),0)","v":0},{"$f":"IF(F9=\"Hot Water Pump\",0,IFERROR(INDEX(VFDSavingsTable,MATCH(1,(State&SelectedZone='Lookup tables'!$D$265:$D$300)*(HVAC!F9='Lookup tables'!$E$265:$E$300)*(HVAC!I9='Lookup tables'!$F$265:$F$300),0),MATCH(1,(HVAC!G9='Lookup tables'!$G$263:$V$263)*(\"kW\"='Lookup tables'!$G$264:$V$264),0)),0))","v":0},{"$f":"IF(F9=\"Hot Water Pump\",IFERROR(INDEX(VFDSavingsTable,MATCH(1,(State&SelectedZone='Lookup tables'!$D$265:$D$300)*(HVAC!F9='Lookup tables'!$E$265:$E$300)*(HVAC!I9='Lookup tables'!$F$265:$F$300),0),MATCH(1,(HVAC!G9='Lookup tables'!$G$263:$V$263)*(\"kW\"='Lookup tables'!$G$264:$V$264),0)),0),0)","v":0}]
[null,0,0,0,null,null,null,null,null,null,null,{"$f":"IFERROR(INDEX(VFDSavingsTable,MATCH(1,(State&SelectedZone='Lookup tables'!$D$265:$D$300)*(HVAC!F10='Lookup tables'!$E$265:$E$300)*(HVAC!I10='Lookup tables'!$F$265:$F$300),0),MATCH(1,(HVAC!G10='Lookup tables'!$G$263:$V$263)*(\"kWh\"='Lookup tables'!$G$264:$V$264),0)),0)","v":0},{"$f":"IF(F10=\"Hot Water Pump\",0,IFERROR(INDEX(VFDSavingsTable,MATCH(1,(State&SelectedZone='Lookup tables'!$D$265:$D$300)*(HVAC!F10='Lookup tables'!$E$265:$E$300)*(HVAC!I10='Lookup tables'!$F$265:$F$300),0),MATCH(1,(HVAC!G10='Lookup tables'!$G$263:$V$263)*(\"kW\"='Lookup tables'!$G$264:$V$264),0)),0))","v":0},{"$f":"IF(F10=\"Hot Water Pump\",IFERROR(INDEX(VFDSavingsTable,MATCH(1,(State&SelectedZone='Lookup tables'!$D$265:$D$300)*(HVAC!F10='Lookup tables'!$E$265:$E$300)*(HVAC!I10='Lookup tables'!$F$265:$F$300),0),MATCH(1,(HVAC!G10='Lookup tables'!$G$263:$V$263)*(\"kW\"='Lookup tables'!$G$264:$V$264),0)),0),0)","v":0}]
[null,0,0,0,null,null,null,null,null,null,null,{"$f":"IFERROR(INDEX(VFDSavingsTable,MATCH(1,(State&SelectedZone='Lookup tables'!$D$265:$D$300)*(HVAC!F11='Lookup tables'!$E$265:$E$300)*(HVAC!I11='Lookup tables'!$F$265:$F$300),0),MATCH(1,(HVAC!G11='Lookup tables'!$G$263:$V$263)*(\"kWh\"='Lookup tables'!$G$264:$V$264),0)),0)","v":0},{"$f":"IF(F11=\"Hot Water Pump\",0,IFERROR(INDEX(VFDSavingsTable,MATCH(1,(State&SelectedZone='Lookup tables'!$D$265:$D$300)*(HVAC!F11='Lookup tables'!$E$265:$E$300)*(HVAC!I11='Lookup tables'!$F$265:$F$300),0),MATCH(1,(HVAC!G11='Lookup tables'!$G$263:$V$263)*(\"kW\"='Lookup tables'!$G$264:$V$264),0)),0))","v":0},{"$f":"IF(F11=\"Hot Water Pump\",IFERROR(INDEX(VFDSavingsTable,MATCH(1,(State&SelectedZone='Lookup tables'!$D$265:$D$300)*(HVAC!F11='Lookup tables'!$E$265:$E$300)*(HVAC!I11='Lookup tables'!$F$265:$F$300),0),MATCH(1,(HVAC!G11='Lookup tables'!$G$263:$V$263)*(\"kW\"='Lookup tables'!$G$264:$V$264),0)),0),0)","v":0}]
[null,0,0,0,null,null,null,null,null,null,null,{"$f":"IFERROR(INDEX(VFDSavingsTable,MATCH(1,(State&SelectedZone='Lookup tables'!$D$265:$D$300)*(HVAC!F12='Lookup tables'!$E$265:$E$300)*(HVAC!I12='Lookup tables'!$F$265:$F$300),0),MATCH(1,(HVAC!G12='Lookup tables'!$G$263:$V$263)*(\"kWh\"='Lookup tables'!$G$264:$V$264),0)),0)","v":0},{"$f":"IF(F12=\"Hot Water Pump\",0,IFERROR(INDEX(VFDSavingsTable,MATCH(1,(State&SelectedZone='Lookup tables'!$D$265:$D$300)*(HVAC!F12='Lookup tables'!$E$265:$E$300)*(HVAC!I12='Lookup tables'!$F$265:$F$300),0),MATCH(1,(HVAC!G12='Lookup tables'!$G$263:$V$263)*(\"kW\"='Lookup tables'!$G$264:$V$264),0)),0))","v":0},{"$f":"IF(F12=\"Hot Water Pump\",IFERROR(INDEX(VFDSavingsTable,MATCH(1,(State&SelectedZone='Lookup tables'!$D$265:$D$300)*(HVAC!F12='Lookup tables'!$E$265:$E$300)*(HVAC!I12='Lookup tables'!$F$265:$F$300),0),MATCH(1,(HVAC!G12='Lookup tables'!$G$263:$V$263)*(\"kW\"='Lookup tables'!$G$264:$V$264),0)),0),0)","v":0}]
[null,0,0,0,null,null,null,null,null,null,null,{"$f":"IFERROR(INDEX(VFDSavingsTable,MATCH(1,(State&SelectedZone='Lookup tables'!$D$265:$D$300)*(HVAC!F13='Lookup tables'!$E$265:$E$300)*(HVAC!I13='Lookup tables'!$F$265:$F$300),0),MATCH(1,(HVAC!G13='Lookup tables'!$G$263:$V$263)*(\"kWh\"='Lookup tables'!$G$264:$V$264),0)),0)","v":0},{"$f":"IF(F13=\"Hot Water Pump\",0,IFERROR(INDEX(VFDSavingsTable,MATCH(1,(State&SelectedZone='Lookup tables'!$D$265:$D$300)*(HVAC!F13='Lookup tables'!$E$265:$E$300)*(HVAC!I13='Lookup tables'!$F$265:$F$300),0),MATCH(1,(HVAC!G13='Lookup tables'!$G$263:$V$263)*(\"kW\"='Lookup tables'!$G$264:$V$264),0)),0))","v":0},{"$f":"IF(F13=\"Hot Water Pump\",IFERROR(INDEX(VFDSavingsTable,MATCH(1,(State&SelectedZone='Lookup tables'!$D$265:$D$300)*(HVAC!F13='Lookup tables'!$E$265:$E$300)*(HVAC!I13='Lookup tables'!$F$265:$F$300),0),MATCH(1,(HVAC!G13='Lookup tables'!$G$263:$V$263)*(\"kW\"='Lookup tables'!$G$264:$V$264),0)),0),0)","v":0}]
[null,0,0,0,null,null,null,null,null,null,null,{"$f":"IFERROR(INDEX(VFDSavingsTable,MATCH(1,(State&SelectedZone='Lookup tables'!$D$265:$D$300)*(HVAC!F14='Lookup tables'!$E$265:$E$300)*(HVAC!I14='Lookup tables'!$F$265:$F$300),0),MATCH(1,(HVAC!G14='Lookup tables'!$G$263:$V$263)*(\"kWh\"='Lookup tables'!$G$264:$V$264),0)),0)","v":0},{"$f":"IF(F14=\"Hot Water Pump\",0,IFERROR(INDEX(VFDSavingsTable,MATCH(1,(State&SelectedZone='Lookup tables'!$D$265:$D$300)*(HVAC!F14='Lookup tables'!$E$265:$E$300)*(HVAC!I14='Lookup tables'!$F$265:$F$300),0),MATCH(1,(HVAC!G14='Lookup tables'!$G$263:$V$263)*(\"kW\"='Lookup tables'!$G$264:$V$264),0)),0))","v":0},{"$f":"IF(F14=\"Hot Water Pump\",IFERROR(INDEX(VFDSavingsTable,MATCH(1,(State&SelectedZone='Lookup tables'!$D$265:$D$300)*(HVAC!F14='Lookup tables'!$E$265:$E$300)*(HVAC!I14='Lookup tables'!$F$265:$F$300),0),MATCH(1,(HVAC!G14='Lookup tables'!$G$263:$V$263)*(\"kW\"='Lookup tables'!$G$264:$V$264),0)),0),0)","v":0}]
[null,{"$f":"SUM(B5:B14)","v":0},{"$f":"SUM(C5:C14)","v":0},{"$f":"SUM(D5:D14)","v":0},"Eligibility Criteria:","·Retrofit Only\n·AHU Supply Fans cannnot have Variable Pitch Blades",null,null,null,null,null,null,{"$f":"SUMPRODUCT(M5:M14,E5:E14,H5:H14)","v":0},{"$f":"SUMPRODUCT(N5:N14,E5:E14,H5:H14)","v":0}]
[null,"Condenser Air Evaporative Pre-Cooling"]
[null,"Peak kW","NCP kW","kWh","Building Type","HVAC Equipment Type","HVAC AHRI Capacity \n(Tons or Btu/h)","HVAC AHRI Full-Load Efficiency* \n(EER or kW/ton)","HVAC AHRI Part-Load Efficiency* (SEER, IEER, or kW/ton)","Unit Quantity",null,"DRF","EFLH red","Tons to use","FL to use (kW/ton)","PL to use (kW/ton)","kWh savings","kW savings"]
[null,{"$f":"IFERROR(R18,0)","v":0},{"$f":"IFERROR(R18,0)","v":0},{"$f":"IFERROR(Q18,0)","v":0},null,null,null,null,null,null,null,{"$f":"INDEX('Lookup tables'!$E$306:$P$328,MATCH(E18,'Lookup tables'!$D$306:$D$328,0),MATCH(State&SelectedZone&IF(F18=\"Direct Expansion\",\"DX\",IF(F18=\"Air Cooled Chiller\",\"ACC\")),'Lookup tables'!$E$305:$P$305,0))","v":{"$error":"#N/A"}},{"$f":"INDEX('Lookup tables'!$Q$306:$AB$328,MATCH(E18,'Lookup tables'!$D$306:$D$328,0),MATCH(State&SelectedZone&IF(F18=\"Direct Expansion\",\"DX\",IF(F18=\"Air Cooled Chiller\",\"ACC\")),'Lookup tables'!$E$305:$P$305,0))","v":{"$error":"#N/A"}},{"$f":"IF(G18>1000,G18/12000,G18)","v":0},{"$f":"IF(H18>4,12/H18,H18)","v":0},{"$f":"IF(I18>4,12/I18,I18)","v":0},{"$f":"N18*P18*M18*J18","v":{"$error":"#N/A"}},{"$f":"N18*O18*L18*J18","v":{"$error":"#N/A"}}]
[null,{"$f":"IFERROR(R19,0)","v":0},{"$f":"IFERROR(R19,0)","v":0},{"$f":"IFERROR(Q19,0)","v":0},null,null,null,null,null,null,null,{"$f":"INDEX('Lookup tables'!$E$306:$P$328,MATCH(E19,'Lookup tables'!$D$306:$D$328,0),MATCH(State&SelectedZone&IF(F19=\"Direct Expansion\",\"DX\",IF(F19=\"Air Cooled Chiller\",\"ACC\")),'Lookup tables'!$E$305:$P$305,0))","v":{"$error":"#N/A"}},{"$f":"INDEX('Lookup tables'!$Q$306:$AB$328,MATCH(E19,'Lookup tables'!$D$306:$D$328,0),MATCH(State&SelectedZone&IF(F19=\"Direct Expansion\",\"DX\",IF(F19=\"Air Cooled Chiller\",\"ACC\")),'Lookup tables'!$E$305:$P$305,0))","v":{"$error":"#N/A"}},{"$f":"IF(G19>1000,G19/12000,G19)","v":0},{"$f":"IF(H19>4,12/H19,H19)","v":0},0,{"$f":"N19*P19*M19*J19","v":{"$error":"#N/A"}},{"$f":"N19*O19*L19*J19","v":{"$error":"#N/A"}}]
[null,{"$f":"IFERROR(R20,0)","v":0},{"$f":"IFERROR(R20,0)","v":0},{"$f":"IFERROR(Q20,0)","v":0},null,null,null,null,null,null,null,{"$f":"INDEX('Lookup tables'!$E$306:$P$328,MATCH(E20,'Lookup tables'!$D$306:$D$328,0),MATCH(State&SelectedZone&IF(F20=\"Direct Expansion\",\"DX\",IF(F20=\"Air Cooled Chiller\",\"ACC\")),'Lookup tables'!$E$305:$P$305,0))","v":{"$error":"#N/A"}},{"$f":"INDEX('Lookup tables'!$Q$306:$AB$328,MATCH(E20,'Lookup tables'!$D$306:$D$328,0),MATCH(State&SelectedZone&IF(F20=\"Direct Expansion\",\"DX\",IF(F20=\"Air Cooled Chiller\",\"ACC\")),'Lookup tables'!$E$305:$P$305,0))","v":{"$error":"#N/A"}},0,0,0,{"$f":"N20*P20*M20*J20","v":{"$error":"#N/A"}},{"$f":"N20*O20*L20*J20","v":{"$error":"#N/A"}}]
[null,{"$f":"IFERROR(R21,0)","v":0},{"$f":"IFERROR(R21,0)","v":0},{"$f":"IFERROR(Q21,0)","v":0},null,null,null,null,null,null,null,{"$f":"INDEX('Lookup tables'!$E$306:$P$328,MATCH(E21,'Lookup tables'!$D$306:$D$328,0),MATCH(State&SelectedZone&IF(F21=\"Direct Expansion\",\"DX\",IF(F21=\"Air Cooled Chiller\",\"ACC\")),'Lookup tables'!$E$305:$P$305,0))","v":{"$error":"#N/A"}},{"$f":"INDEX('Lookup tables'!$Q$306:$AB$328,MATCH(E21,'Lookup tables'!$D$306:$D$328,0),MATCH(State&SelectedZone&IF(F21=\"Direct Expansion\",\"DX\",IF(F21=\"Air Cooled Chiller\",\"ACC\")),'Lookup tables'!$E$305:$P$305,0))","v":{"$error":"#N/A"}},0,0,0,{"$f":"N21*P21*M21*J21","v":{"$error":"#N/A"}},{"$f":"N21*O21*L21*J21","v":{"$error":"#N/A"}}]
[null,{"$f":"IFERROR(R22,0)","v":0},{"$f":"IFERROR(R22,0)","v":0},{"$f":"IFERROR(Q22,0)","v":0},null,null,null,null,null,null,null,{"$f":"INDEX('Lookup tables'!$E$306:$P$328,MATCH(E22,'Lookup tables'!$D$306:$D$328,0),MATCH(State&SelectedZone&IF(F22=\"Direct Expansion\",\"DX\",IF(F22=\"Air Cooled Chiller\",\"ACC\")),'Lookup tables'!$E$305:$P$305,0))","v":{"$error":"#N/A"}},{"$f":"INDEX('Lookup tables'!$Q$306:$AB$328,MATCH(E22,'Lookup tables'!$D$306:$D$328,0),MATCH(State&SelectedZone&IF(F22=\"Direct Expansion\",\"DX\",IF(F22=\"Air Cooled Chiller\",\"ACC\")),'Lookup tables'!$E$305:$P$305,0))","v":{"$error":"#N/A"}},0,0,0,{"$f":"N22*P22*M22*J22","v":{"$error":"#N/A"}},{"$f":"N22*O22*L22*J22","v":{"$error":"#N/A"}}]
[null,{"$f":"SUM(B18:B22)","v":0},{"$f":"SUM(C18:C22)","v":0},{"$f":"SUM(D18:D22)","v":0},"Eligibility Criteria:","·Must exceed evaporative effectiveness performance of 75% during peak weather conditions.",null,"*If unknown, reference the TX TRM 7.0 Vol 3: tables 2-25 through 2.29 for Air Conditioners & Heat Pumps, or tables 2-40 through 2-51 for Chillers."]
[null,"Hotel, Motel, & Dormitory Occupancy Controls (NC & Retro)"]
[null,"Peak kW","NCP kW","kWh","Number of Rooms","Building Type","Proposed Control Type","Heating Type","Temperature Offset Range"]
[null,{"$f":"IFERROR($E26*INDEX('Lookup tables'!$H$336:$AE$353,MATCH(State&SelectedZone&$F26,'Lookup tables'!$G$336:$G$353,0),MATCH($I26&$H26&$G26&B$4,'Lookup tables'!$H$335:$AE$335,0)),0)","v":0},{"$f":"IFERROR($E26*INDEX('Lookup tables'!$H$336:$AE$353,MATCH(State&SelectedZone&$F26,'Lookup tables'!$G$336:$G$353,0),MATCH($I26&$H26&$G26&C$4,'Lookup tables'!$H$335:$AE$335,0)),0)","v":0},{"$f":"IFERROR($E26*INDEX('Lookup tables'!$H$336:$AE$353,MATCH(State&SelectedZone&$F26,'Lookup tables'!$G$336:$G$353,0),MATCH($I26&$H26&$G26&D$4,'Lookup tables'!$H$335:$AE$335,0)),0)","v":0}]
[null,{"$f":"IFERROR($E27*INDEX('Lookup tables'!$H$336:$AE$353,MATCH(State&SelectedZone&$F27,'Lookup tables'!$G$336:$G$353,0),MATCH($I27&$H27&$G27&B$4,'Lookup tables'!$H$335:$AE$335,0)),0)","v":0},{"$f":"IFERROR($E27*INDEX('Lookup tables'!$H$336:$AE$353,MATCH(State&SelectedZone&$F27,'Lookup tables'!$G$336:$G$353,0),MATCH($I27&$H27&$G27&C$4,'Lookup tables'!$H$335:$AE$335,0)),0)","v":0},{"$f":"IFERROR($E27*INDEX('Lookup tables'!$H$336:$AE$353,MATCH(State&SelectedZone&$F27,'Lookup tables'!$G$336:$G$353,0),MATCH($I27&$H27&$G27&D$4,'Lookup tables'!$H$335:$AE$335,0)),0)","v":0}]
[null,{"$f":"IFERROR($E28*INDEX('Lookup tables'!$H$336:$AE$353,MATCH(State&SelectedZone&$F28,'Lookup tables'!$G$336:$G$353,0),MATCH($I28&$H28&$G28&B$4,'Lookup tables'!$H$335:$AE$335,0)),0)","v":0},{"$f":"IFERROR($E28*INDEX('Lookup tables'!$H$336:$AE$353,MATCH(State&SelectedZone&$F28,'Lookup tables'!$G$336:$G$353,0),MATCH($I28&$H28&$G28&C$4,'Lookup tables'!$H$335:$AE$335,0)),0)","v":0},{"$f":"IFERROR($E28*INDEX('Lookup tables'!$H$336:$AE$353,MATCH(State&SelectedZone&$F28,'Lookup tables'!$G$336:$G$353,0),MATCH($I28&$H28&$G28&D$4,'Lookup tables'!$H$335:$AE$335,0)),0)","v":0}]
[null,{"$f":"SUM(B26:B28)","v":0},{"$f":"SUM(C26:C28)","v":0},{"$f":"SUM(D26:D28)","v":0}]
[null,"Commercial Smart Thermostats",null,null,null,null,null,null,null,null,null,null,"Cooling Efficiency (kW/ton)","Heating Efficiency (COP)",null,"RR_c"]
[null,"Peak kW","NCP kW","kWh","Building Type","HVAC Equipment Type","Controlled HVAC Capacity\n(Tons or Btu/h)","HVAC Part-Load Cooling Efficiency* \n(SEER, IEER, or kW/ton)","HVAC Heating Efficiency*\n(HSPF or COP)","Unit Quantity",null,"Capacity (tons)",null,null,"EFLH Phrase Lookup",null,"EFLH_c","kWh_c","RR_h","EFLH_h","kWh_h"]
[null,0,0,{"$f":"R32+U32","v":0},null,null,null,null,null,null,null,{"$f":"G32/IF(G32>1000,12000,1)","v":0},{"$f":"IF(H32>3,12/H32,H32)","v":0},{"$f":"IF(I32>6,I32/3.412,I32)","v":0},{"$f":"IF(LEFT(F32,2)=\"DX\",\"DX\",SUBSTITUTE(F32,\" \",\"\"))&State&SelectedZone","v":{"$error":"#N/A"}},0.1,{"$f":"INDEX('Lookup tables'!E$362:X$387,MATCH(E32,'Lookup tables'!D$362:D$387,0),MATCH(O32&\"c\",'Lookup tables'!E$361:X$361,0))","v":{"$error":"#N/A"}},{"$f":"IFERROR(J32*P32*L32*M32*Q32,0)","v":0},0.08,{"$f":"IF(F32=\"DX - Heat Pump\",INDEX('Lookup tables'!E$362:X$387,MATCH(E32,'Lookup tables'!D$362:D$387,0),MATCH(O32&\"h\",'Lookup tables'!E$361:X$361,0)),0)","v":0},{"$f":"IFERROR(J32*S32*L32/N32*T32*12/3.412,0)","v":0}]
[null,0,0,{"$f":"R33+U33","v":0},null,null,null,null,null,null,null,{"$f":"G33/IF(G33>1000,12000,1)","v":0},{"$f":"IF(H33>3,12/H33,H33)","v":0},{"$f":"IF(I33>6,I33/3.412,I33)","v":0},{"$f":"IF(LEFT(F33,2)=\"DX\",\"DX\",SUBSTITUTE(F33,\" \",\"\"))&State&SelectedZone","v":{"$error":"#N/A"}},0.1,{"$f":"INDEX('Lookup tables'!E$362:X$387,MATCH(E33,'Lookup tables'!D$362:D$387,0),MATCH(O33&\"c\",'Lookup tables'!E$361:X$361,0))","v":{"$error":"#N/A"}},{"$f":"IFERROR(J33*P33*L33*M33*Q33,0)","v":0},0.08,{"$f":"IF(F33=\"DX - Heat Pump\",INDEX('Lookup tables'!E$362:X$387,MATCH(E33,'Lookup tables'!D$362:D$387,0),MATCH(O33&\"h\",'Lookup tables'!E$361:X$361,0)),0)","v":0},{"$f":"IFERROR(J33*S33*L33/N33*T33*12/3.412,0)","v":0}]
[null,0,0,{"$f":"R34+U34","v":0},null,null,null,null,null,null,null,0,0,0,{"$f":"IF(LEFT(F34,2)=\"DX\",\"DX\",SUBSTITUTE(F34,\" \",\"\"))&State&SelectedZone","v":{"$error":"#N/A"}},0.1,{"$f":"INDEX('Lookup tables'!E$362:X$387,MATCH(E34,'Lookup tables'!D$362:D$387,0),MATCH(O34&\"c\",'Lookup tables'!E$361:X$361,0))","v":{"$error":"#N/A"}},{"$f":"IFERROR(J34*P34*L34*M34*Q34,0)","v":0},0.08,{"$f":"IF(F34=\"DX - Heat Pump\",INDEX('Lookup tables'!E$362:X$387,MATCH(E34,'Lookup tables'!D$362:D$387,0),MATCH(O34&\"h\",'Lookup tables'!E$361:X$361,0)),0)","v":0},0]
[null,{"$f":"SUM(B32:B34)","v":0},{"$f":"SUM(C32:C34)","v":0},{"$f":"SUM(D32:D34)","v":0},null,null,null,"*If unknown, reference the TX TRM 7.0 Vol 3: tables 2-25 through 2.29 for Air Conditioners & Heat Pumps, or tables 2-40 through 2-51 for Chillers."]
[null,"High-Volume Low-Speed (HVLS) Fans"]
[null,"Peak kW","NCP kW","kWh","Quantity","Fan Motor Size (HP)","Airflow (CFM)",null,null,null,null,null,"WbaseROB/NC","Hours","W_HVLS","CF","kWh","kW"]
[null,{"$f":"R38","v":0},{"$f":"B38","v":0},{"$f":"Q38","v":0},null,null,null,null,null,null,null,null,{"$f":"G38/22","v":0},{"$f":"INDEX('Lookup tables'!E$391:E$396,MATCH(State&SelectedZone,'Lookup tables'!D$391:D$396,0))","v":{"$error":"#N/A"}},{"$f":"F38*746","v":0},1,{"$f":"IF(COUNTA(E38:G38)<3,0,E38*(M38-O38)/1000*N38)","v":0},{"$f":"IF(COUNTA(E38:G38)<3,0,E38*(M38-O38)/1000*P38)","v":0}]
[null,{"$f":"R39","v":0},{"$f":"B39","v":0},{"$f":"Q39","v":0},null,null,null,null,null,null,null,null,{"$f":"G39/22","v":0},{"$f":"INDEX('Lookup tables'!E$391:E$396,MATCH(State&SelectedZone,'Lookup tables'!D$391:D$396,0))","v":{"$error":"#N/A"}},{"$f":"F39*746","v":0},1,{"$f":"IF(COUNTA(E39:G39)<3,0,E39*(M39-O39)/1000*N39)","v":0},{"$f":"IF(COUNTA(E39:G39)<3,0,E39*(M39-O39)/1000*P39)","v":0}]
[null,{"$f":"R40","v":0},{"$f":"B40","v":0},{"$f":"Q40","v":0},null,null,null,null,null,null,null,null,{"$f":"G40/22","v":0},{"$f":"INDEX('Lookup tables'!E$391:E$396,MATCH(State&SelectedZone,'Lookup tables'!D$391:D$396,0))","v":{"$error":"#N/A"}},{"$f":"F40*746","v":0},1,{"$f":"IF(COUNTA(E40:G40)<3,0,E40*(M40-O40)/1000*N40)","v":0},{"$f":"IF(COUNTA(E40:G40)<3,0,E40*(M40-O40)/1000*P40)","v":0}]
[null,{"$f":"SUM(B38:B40)","v":0},{"$f":"SUM(C38:C40)","v":0},{"$f":"SUM(D38:D40)","v":0}]

{"sheet":"Motors","index":7,"n_rows":22,"n_cols":34,"rows_kept":22,"cut":false,"hidden":true,"merged":[[16,20,17,20],[16,12,17,12],[16,13,17,13],[16,14,17,14],[16,21,17,21],[16,15,17,15],[16,16,17,16],[16,17,17,17],[16,18,17,18],[16,19,17,19]]}
[null,"Motor Measures",null,null,null,null,null,null,null,null,null,null,"HIDE","HIDE","HIDE","HIDE","HIDE","HIDE","HIDE","HIDE","HIDE","HIDE","HIDE","HIDE","HIDE","HIDE","HIDE","HIDE","HIDE","HIDE","HIDE","HIDE","HIDE","HIDE"]
[null,"Click on headings to expand or collapse sections. Blue Peak kW values indicate winter peak."]
[null,"ENERGY STAR Commercial Pool Pumps"]
[null,"Peak kW","NCP kW","kWh","Pump Quantity","Rated Pump hp (New)","Pool Operation",null,null,null,null,null,"kWh savings","kW savings"]
[null,{"$f":"IFERROR(N5,0)","v":0},{"$f":"IFERROR(N5,0)","v":0},{"$f":"IFERROR(M5,0)","v":0},null,null,null,null,null,null,null,null,{"$f":"INDEX('Lookup tables'!$E$401:$G$405,MATCH(F5,'Lookup tables'!$D$401:$D$405,0),MATCH(G5,'Lookup tables'!$E$400:$G$400,0))*E5","v":{"$error":"#N/A"}},{"$f":"INDEX('Lookup tables'!$H$401:$H$405,MATCH(F5,'Lookup tables'!$D$401:$D$405,0))*E5","v":{"$error":"#N/A"}}]
[null,{"$f":"IFERROR(N6,0)","v":0},{"$f":"IFERROR(N6,0)","v":0},{"$f":"IFERROR(M6,0)","v":0},null,null,null,null,null,null,null,null,{"$f":"INDEX('Lookup tables'!$E$401:$G$405,MATCH(F6,'Lookup tables'!$D$401:$D$405,0),MATCH(G6,'Lookup tables'!$E$400:$G$400,0))*E6","v":{"$error":"#N/A"}},{"$f":"INDEX('Lookup tables'!$H$401:$H$405,MATCH(F6,'Lookup tables'!$D$401:$D$405,0))*E6","v":{"$error":"#N/A"}}]
[null,0,0,0,null,null,null,null,null,null,null,null,{"$f":"INDEX('Lookup tables'!$E$401:$G$405,MATCH(F7,'Lookup tables'!$D$401:$D$405,0),MATCH(G7,'Lookup tables'!$E$400:$G$400,0))*E7","v":{"$error":"#N/A"}},{"$f":"INDEX('Lookup tables'!$H$401:$H$405,MATCH(F7,'Lookup tables'!$D$401:$D$405,0))*E7","v":{"$error":"#N/A"}}]
[null,{"$f":"SUM(B5:B7)","v":0},{"$f":"SUM(C5:C7)","v":0},{"$f":"SUM(D5:D7)","v":0}]
[null,"Premium Efficiency Motors"]
[null,"Peak kW","NCP kW","kWh","Motor Quantity","Application","Replacement Type","Age of Existing Motor (Years)\n(Early Retirement Only)","New Motor Size (HP)","New Motor Type","New Motor Efficiency",null,"LF","Hrs","CF","n_ER","kWh_ER","kW_ER","n_ROB","kWh_ROB","kW_ROB","RUL (1T)","EUL","Years 2T","NPV kW 1T","NPV kW 2T","NPV kW Total","NPV kW EUL","kW","NPV kWh 1T","NPV kWh 2T","NPV kWh Total","NPV kWh EUL","kWh"]
[null,{"$f":"IFERROR(IF(G11=\"Early Retirement\",AC11,U11),0)","v":0},{"$f":"B11","v":0},{"$f":"IFERROR(IF(G11=\"Early Retirement\",AH11,T11),0)","v":0},null,null,null,null,null,null,null,null,{"$f":"INDEX('Lookup tables'!E$410:P$423,MATCH(Motors!F11,MotorApplications,0),MATCH(Motors!I11,'Lookup tables'!E409:J409,1))","v":{"$error":"#N/A"}},{"$f":"INDEX('Lookup tables'!K$410:P$423,MATCH(Motors!F11,MotorApplications,0),MATCH(Motors!I11,'Lookup tables'!E409:J409,1))","v":{"$error":"#N/A"}},1,{"$f":"INDEX('Lookup tables'!K$428:P$452,MATCH(Motors!I11,MotorHP,0),MATCH(Motors!J11,MotorType,0))","v":{"$error":"#N/A"}},{"$f":"E11*I11*0.746*M11*(1/P11-1/K11)*N11","v":{"$error":"#N/A"}},{"$f":"(Q11/IF(IFERROR(SEARCH(\"Industrial\",F11)>0,FALSE),8760,N11))*O11","v":{"$error":"#N/A"}},{"$f":"INDEX(NEMAtable,MATCH(Motors!I11,MotorHP,0),MATCH(Motors!J11,MotorType,0))","v":{"$error":"#N/A"}},{"$f":"E11*I11*0.746*M11*(1/S11-1/K11)*N11","v":{"$error":"#N/A"}},{"$f":"(T11/IF(IFERROR(SEARCH(\"Industrial\",F11)>0,FALSE),8760,N11))*O11","v":{"$error":"#N/A"}},{"$f":"INDEX(MotorRUL,MATCH(H11,MotorAge,0))","v":{"$error":"#N/A"}},15,{"$f":"W11-V11","v":{"$error":"#N/A"}},{"$f":"ACkW*(1+e)/(d-e)*(1-((1+e)/(1+d))^V11)*R11","v":{"$error":"#DIV/0!"}},{"$f":"ACkW*(1+e)/(d-e)*(1-((1+e)/(1+d))^X11)*(1+e)^V11/(1+d)^V11*U11","v":{"$error":"#DIV/0!"}},{"$f":"Y11+Z11","v":{"$error":"#DIV/0!"}},{"$f":"ACkW*(1+e)/(d-e)*(1-((1+e)/(1+d))^W11)","v":{"$error":"#DIV/0!"}},{"$f":"AA11/AB11","v":{"$error":"#DIV/0!"}},{"$f":"ACkWh*(1+e)/(d-e)*(1-((1+e)/(1+d))^V11)*Q11","v":{"$error":"#DIV/0!"}},{"$f":"ACkWh*(1+e)/(d-e)*(1-((1+e)/(1+d))^X11)*(1+e)^V11/(1+d)^V11*T11","v":{"$error":"#DIV/0!"}},{"$f":"AD11+AE11","v":{"$error":"#DIV/0!"}},{"$f":"ACkWh*(1+e)/(d-e)*(1-((1+e)/(1+d))^W11)","v":{"$error":"#DIV/0!"}},{"$f":"AF11/AG11","v":{"$error":"#DIV/0!"}}]
[null,{"$f":"IFERROR(IF(G12=\"Early Retirement\",AC12,U12),0)","v":0},{"$f":"B12","v":0},{"$f":"IFERROR(IF(G12=\"Early Retirement\",AH12,T12),0)","v":0},null,null,null,null,null,null,null,null,{"$f":"INDEX('Lookup tables'!E$410:P$423,MATCH(Motors!F12,MotorApplications,0),MATCH(Motors!I12,'Lookup tables'!E410:J410,1))","v":{"$error":"#N/A"}},{"$f":"INDEX('Lookup tables'!K$410:P$423,MATCH(Motors!F12,MotorApplications,0),MATCH(Motors!I12,'Lookup tables'!E410:J410,1))","v":{"$error":"#N/A"}},1,{"$f":"INDEX('Lookup tables'!K$428:P$452,MATCH(Motors!I12,MotorHP,0),MATCH(Motors!J12,MotorType,0))","v":{"$error":"#N/A"}},{"$f":"E12*I12*0.746*M12*(1/P12-1/K12)*N12","v":{"$error":"#N/A"}},{"$f":"(Q12/IF(IFERROR(SEARCH(\"Industrial\",F12)>0,FALSE),8760,N12))*O12","v":{"$error":"#N/A"}},{"$f":"INDEX(NEMAtable,MATCH(Motors!I12,MotorHP,0),MATCH(Motors!J12,MotorType,0))","v":{"$error":"#N/A"}},{"$f":"E12*I12*0.746*M12*(1/S12-1/K12)*N12","v":{"$error":"#N/A"}},{"$f":"(T12/IF(IFERROR(SEARCH(\"Industrial\",F12)>0,FALSE),8760,N12))*O12","v":{"$error":"#N/A"}},{"$f":"INDEX(MotorRUL,MATCH(H12,MotorAge,0))","v":{"$error":"#N/A"}},16,{"$f":"W12-V12","v":{"$error":"#N/A"}},{"$f":"ACkW*(1+e)/(d-e)*(1-((1+e)/(1+d))^V12)*R12","v":{"$error":"#DIV/0!"}},{"$f":"ACkW*(1+e)/(d-e)*(1-((1+e)/(1+d))^X12)*(1+e)^V12/(1+d)^V12*U12","v":{"$error":"#DIV/0!"}},{"$f":"Y12+Z12","v":{"$error":"#DIV/0!"}},{"$f":"ACkW*(1+e)/(d-e)*(1-((1+e)/(1+d))^W12)","v":{"$error":"#DIV/0!"}},{"$f":"AA12/AB12","v":{"$error":"#DIV/0!"}},{"$f":"ACkWh*(1+e)/(d-e)*(1-((1+e)/(1+d))^V12)*Q12","v":{"$error":"#DIV/0!"}},{"$f":"ACkWh*(1+e)/(d-e)*(1-((1+e)/(1+d))^X12)*(1+e)^V12/(1+d)^V12*T12","v":{"$error":"#DIV/0!"}},{"$f":"AD12+AE12","v":{"$error":"#DIV/0!"}},{"$f":"ACkWh*(1+e)/(d-e)*(1-((1+e)/(1+d))^W12)","v":{"$error":"#DIV/0!"}},{"$f":"AF12/AG12","v":{"$error":"#DIV/0!"}}]
[null,{"$f":"IFERROR(IF(G13=\"Early Retirement\",AC13,U13),0)","v":0},0,{"$f":"IFERROR(IF(G13=\"Early Retirement\",AH13,T13),0)","v":0},null,null,null,null,null,null,null,null,{"$f":"INDEX('Lookup tables'!E$410:P$423,MATCH(Motors!F13,MotorApplications,0),MATCH(Motors!I13,'Lookup tables'!E411:J411,1))","v":{"$error":"#N/A"}},{"$f":"INDEX('Lookup tables'!K$410:P$423,MATCH(Motors!F13,MotorApplications,0),MATCH(Motors!I13,'Lookup tables'!E411:J411,1))","v":{"$error":"#N/A"}},1,{"$f":"INDEX('Lookup tables'!K$428:P$452,MATCH(Motors!I13,MotorHP,0),MATCH(Motors!J13,MotorType,0))","v":{"$error":"#N/A"}},{"$error":"#N/A"},{"$error":"#N/A"},{"$f":"INDEX(NEMAtable,MATCH(Motors!I13,MotorHP,0),MATCH(Motors!J13,MotorType,0))","v":{"$error":"#N/A"}},{"$error":"#N/A"},{"$error":"#N/A"},{"$f":"INDEX(MotorRUL,MATCH(H13,MotorAge,0))","v":{"$error":"#N/A"}},17,{"$error":"#N/A"},{"$f":"ACkW*(1+e)/(d-e)*(1-((1+e)/(1+d))^V13)*R13","v":{"$error":"#DIV/0!"}},{"$f":"ACkW*(1+e)/(d-e)*(1-((1+e)/(1+d))^X13)*(1+e)^V13/(1+d)^V13*U13","v":{"$error":"#DIV/0!"}},{"$error":"#DIV/0!"},{"$f":"ACkW*(1+e)/(d-e)*(1-((1+e)/(1+d))^W13)","v":{"$error":"#DIV/0!"}},{"$error":"#DIV/0!"},{"$f":"ACkWh*(1+e)/(d-e)*(1-((1+e)/(1+d))^V13)*Q13","v":{"$error":"#DIV/0!"}},{"$f":"ACkWh*(1+e)/(d-e)*(1-((1+e)/(1+d))^X13)*(1+e)^V13/(1+d)^V13*T13","v":{"$error":"#DIV/0!"}},{"$error":"#DIV/0!"},{"$f":"ACkWh*(1+e)/(d-e)*(1-((1+e)/(1+d))^W13)","v":{"$error":"#DIV/0!"}},{"$error":"#DIV/0!"}]
[null,0,0,0,null,null,null,null,null,null,null,null,{"$f":"INDEX('Lookup tables'!E$410:P$423,MATCH(Motors!F14,MotorApplications,0),MATCH(Motors!I14,'Lookup tables'!E412:J412,1))","v":{"$error":"#N/A"}},{"$f":"INDEX('Lookup tables'!K$410:P$423,MATCH(Motors!F14,MotorApplications,0),MATCH(Motors!I14,'Lookup tables'!E412:J412,1))","v":{"$error":"#N/A"}},1,{"$f":"INDEX('Lookup tables'!K$428:P$452,MATCH(Motors!I14,MotorHP,0),MATCH(Motors!J14,MotorType,0))","v":{"$error":"#N/A"}},{"$error":"#N/A"},{"$error":"#N/A"},{"$f":"INDEX(NEMAtable,MATCH(Motors!I14,MotorHP,0),MATCH(Motors!J14,MotorType,0))","v":{"$error":"#N/A"}},{"$error":"#N/A"},{"$error":"#N/A"},{"$f":"INDEX(MotorRUL,MATCH(H14,MotorAge,0))","v":{"$error":"#N/A"}},18,{"$error":"#N/A"},{"$f":"ACkW*(1+e)/(d-e)*(1-((1+e)/(1+d))^V14)*R14","v":{"$error":"#DIV/0!"}},{"$f":"ACkW*(1+e)/(d-e)*(1-((1+e)/(1+d))^X14)*(1+e)^V14/(1+d)^V14*U14","v":{"$error":"#DIV/0!"}},{"$error":"#DIV/0!"},{"$f":"ACkW*(1+e)/(d-e)*(1-((1+e)/(1+d))^W14)","v":{"$error":"#DIV/0!"}},{"$error":"#DIV/0!"},{"$f":"ACkWh*(1+e)/(d-e)*(1-((1+e)/(1+d))^V14)*Q14","v":{"$error":"#DIV/0!"}},{"$f":"ACkWh*(1+e)/(d-e)*(1-((1+e)/(1+d))^X14)*(1+e)^V14/(1+d)^V14*T14","v":{"$error":"#DIV/0!"}},{"$error":"#DIV/0!"},{"$f":"ACkWh*(1+e)/(d-e)*(1-((1+e)/(1+d))^W14)","v":{"$error":"#DIV/0!"}},{"$error":"#DIV/0!"}]
[null,0,0,0,null,null,null,null,null,null,null,null,{"$f":"INDEX('Lookup tables'!E$410:P$423,MATCH(Motors!F15,MotorApplications,0),MATCH(Motors!I15,'Lookup tables'!E413:J413,1))","v":{"$error":"#N/A"}},{"$f":"INDEX('Lookup tables'!K$410:P$423,MATCH(Motors!F15,MotorApplications,0),MATCH(Motors!I15,'Lookup tables'!E413:J413,1))","v":{"$error":"#N/A"}},1,{"$f":"INDEX('Lookup tables'!K$428:P$452,MATCH(Motors!I15,MotorHP,0),MATCH(Motors!J15,MotorType,0))","v":{"$error":"#N/A"}},{"$error":"#N/A"},{"$error":"#N/A"},{"$f":"INDEX(NEMAtable,MATCH(Motors!I15,MotorHP,0),MATCH(Motors!J15,MotorType,0))","v":{"$error":"#N/A"}},{"$error":"#N/A"},{"$error":"#N/A"},{"$f":"INDEX(MotorRUL,MATCH(H15,MotorAge,0))","v":{"$error":"#N/A"}},19,{"$error":"#N/A"},{"$f":"ACkW*(1+e)/(d-e)*(1-((1+e)/(1+d))^V15)*R15","v":{"$error":"#DIV/0!"}},{"$f":"ACkW*(1+e)/(d-e)*(1-((1+e)/(1+d))^X15)*(1+e)^V15/(1+d)^V15*U15","v":{"$error":"#DIV/0!"}},{"$error":"#DIV/0!"},{"$f":"ACkW*(1+e)/(d-e)*(1-((1+e)/(1+d))^W15)","v":{"$error":"#DIV/0!"}},{"$error":"#DIV/0!"},{"$f":"ACkWh*(1+e)/(d-e)*(1-((1+e)/(1+d))^V15)*Q15","v":{"$error":"#DIV/0!"}},{"$f":"ACkWh*(1+e)/(d-e)*(1-((1+e)/(1+d))^X15)*(1+e)^V15/(1+d)^V15*T15","v":{"$error":"#DIV/0!"}},{"$error":"#DIV/0!"},{"$f":"ACkWh*(1+e)/(d-e)*(1-((1+e)/(1+d))^W15)","v":{"$error":"#DIV/0!"}},{"$error":"#DIV/0!"}]
[null,{"$f":"SUM(B11:B15)","v":0},{"$f":"SUM(C11:C15)","v":0},0]
[null,"Pump-Off Controllers",null,null,null,null,null,null,null,null,null,null,"NEMA eff","Baseline Energy Usage (kWh)","Baseline Demand (kW)","Baseline Operating Hours (Hours)","Efficient Energy Usage (kWh)","Efficient Demand (kW)","Efficient Operating Hours (Hours)","Efficient Hours Adjustment Factor","Customer Energy Savings(kWh)","Peak Coincident Savings (PCkW)"]
[null,"Peak kW","NCP kW","kWh","Motor Horsepower","Motor Type","Volumetric Efficiency (%)"]
[null,{"$f":"IFERROR(IF(G19=\"\",0,V19),0)","v":0},{"$f":"IFERROR(V19,0)","v":0},{"$f":"IFERROR(IF(G19=\"\",0,U19),0)","v":0},null,null,null,null,null,null,null,null,{"$f":"INDEX(NEMAtable,MATCH(Motors!E19,MotorHP,0),MATCH(Motors!F19,MotorType,0))","v":{"$error":"#N/A"}},{"$f":"O19*P19","v":{"$error":"#N/A"}},{"$f":"E19*'Lookup tables'!$E$477*'Lookup tables'!$E$478/M19/'Lookup tables'!$E$479","v":{"$error":"#N/A"}},{"$f":"'Lookup tables'!$E$480*'Lookup tables'!$E$481","v":5694},{"$f":"R19*S19","v":{"$error":"#N/A"}},{"$f":"O19","v":{"$error":"#N/A"}},{"$f":"T19*'Lookup tables'!$E$481","v":730.23360000000002},{"$f":"('Lookup tables'!$E$482+'Lookup tables'!$E$483*G19*'Lookup tables'!$E$480*100)/100","v":8.3360000000000004E-2},{"$f":"N19-Q19","v":{"$error":"#N/A"}},{"$f":"U19/8760","v":{"$error":"#N/A"}}]
[null,{"$f":"IFERROR(IF(G20=\"\",0,V20),0)","v":0},{"$f":"IFERROR(V20,0)","v":0},{"$f":"IFERROR(IF(G20=\"\",0,U20),0)","v":0},null,null,null,null,null,null,null,null,{"$f":"INDEX(NEMAtable,MATCH(Motors!E20,MotorHP,0),MATCH(Motors!F20,MotorType,0))","v":{"$error":"#N/A"}},{"$f":"O20*P20","v":{"$error":"#N/A"}},{"$f":"E20*'Lookup tables'!$E$477*'Lookup tables'!$E$478/M20/'Lookup tables'!$E$479","v":{"$error":"#N/A"}},{"$f":"'Lookup tables'!$E$480*'Lookup tables'!$E$481","v":5694},{"$f":"R20*S20","v":{"$error":"#N/A"}},{"$f":"O20","v":{"$error":"#N/A"}},{"$f":"T20*'Lookup tables'!$E$481","v":730.23360000000002},{"$f":"('Lookup tables'!$E$482+'Lookup tables'!$E$483*G20*'Lookup tables'!$E$480*100)/100","v":8.3360000000000004E-2},{"$f":"N20-Q20","v":{"$error":"#N/A"}},{"$f":"U20/8760","v":{"$error":"#N/A"}}]
[null,0,0,0,null,null,null,null,null,null,null,null,{"$f":"INDEX(NEMAtable,MATCH(Motors!E21,MotorHP,0),MATCH(Motors!F21,MotorType,0))","v":{"$error":"#N/A"}},{"$error":"#N/A"},{"$f":"E21*'Lookup tables'!$E$477*'Lookup tables'!$E$478/M21/'Lookup tables'!$E$479","v":{"$error":"#N/A"}},{"$f":"'Lookup tables'!$E$480*'Lookup tables'!$E$481","v":5694},{"$error":"#N/A"},{"$error":"#N/A"},{"$f":"T21*'Lookup tables'!$E$481","v":730.23360000000002},{"$f":"('Lookup tables'!$E$482+'Lookup tables'!$E$483*G21*'Lookup tables'!$E$480*100)/100","v":8.3360000000000004E-2},{"$error":"#N/A"},{"$error":"#N/A"}]
[null,{"$f":"SUM(B19:B21)","v":0},{"$f":"SUM(C19:C21)","v":0},{"$f":"SUM(D19:D21)","v":0}]

{"sheet":"Misc","index":8,"n_rows":34,"n_cols":21,"rows_kept":34,"cut":false,"hidden":true,"merged":[[16,14,17,14],[9,5,9,6],[9,7,9,8],[15,5,15,6],[15,8,15,9],[16,13,17,13]]}
[null,"Miscellaneous Measures",null,null,null,null,null,null,null,null,null,"HIDE","HIDE","HIDE","HIDE","HIDE","HIDE","HIDE","HIDE","HIDE","HIDE"]
[null,"Click on headings to expand or collapse sections. Blue Peak kW values indicate winter peak."]
[null,"Window Film Treatment"]
[null,"Peak kW","NCP kW","kWh","Area of Window Film (square feet)","Window Orientation","Pre Shading Type","Post Shading Coefficient\n(from manufacturer specs)","HVAC Type",null,null,"SHG","SHGF","SHGF NC","SCpre","SCpost","Conversion Factor (Btu/kW)","COP","kWh"]
[null,{"$f":"IFERROR(IF(H5=\"\",0,E5*M5*(O5-P5)/(Q5*R5)),0)","v":0},{"$f":"IFERROR(IF(H5=\"\",0,E5*N5*(O5-P5)/(Q5*R5)),0)","v":0},{"$f":"IFERROR(IF(H5=\"\",0,S5),0)","v":0},null,null,null,null,null,null,null,{"$f":"VLOOKUP(F5,'Lookup tables'!$D$488:$E$496,2,FALSE)","v":{"$error":"#N/A"}},{"$f":"VLOOKUP(F5,'Lookup tables'!$D$488:$K$496,MATCH(State&SelectedZone,'Lookup tables'!$D$487:$K$487,0),FALSE)","v":{"$error":"#N/A"}},{"$f":"INDEX('Lookup tables'!L$488:L$496,MATCH(Misc!F5,Orientation,0))","v":{"$error":"#N/A"}},{"$f":"VLOOKUP(G5,'Lookup tables'!$O$488:$P$493,2,FALSE)","v":{"$error":"#N/A"}},{"$f":"H5","v":0},3413,{"$f":"VLOOKUP(I5,'Lookup tables'!$R$488:$S$492,2,FALSE)","v":{"$error":"#N/A"}},{"$f":"E5*L5*(O5-P5)/(Q5*R5)","v":{"$error":"#N/A"}}]
[null,{"$f":"IFERROR(IF(H6=\"\",0,E6*M6*(O6-P6)/(Q6*R6)),0)","v":0},{"$f":"IFERROR(IF(H6=\"\",0,E6*N6*(O6-P6)/(Q6*R6)),0)","v":0},{"$f":"IFERROR(IF(H6=\"\",0,S6),0)","v":0},null,null,null,null,null,null,null,{"$f":"VLOOKUP(F6,'Lookup tables'!$D$488:$E$496,2,FALSE)","v":{"$error":"#N/A"}},{"$f":"VLOOKUP(F6,'Lookup tables'!$D$488:$K$496,MATCH(State&SelectedZone,'Lookup tables'!$D$487:$K$487,0),FALSE)","v":{"$error":"#N/A"}},{"$f":"INDEX('Lookup tables'!L$488:L$496,MATCH(Misc!F6,Orientation,0))","v":{"$error":"#N/A"}},{"$f":"VLOOKUP(G6,'Lookup tables'!$O$488:$P$493,2,FALSE)","v":{"$error":"#N/A"}},{"$f":"H6","v":0},3413,{"$f":"VLOOKUP(I6,'Lookup tables'!$R$488:$S$492,2,FALSE)","v":{"$error":"#N/A"}},{"$f":"E6*L6*(O6-P6)/(Q6*R6)","v":{"$error":"#N/A"}}]
[null,{"$f":"IFERROR(IF(H7=\"\",0,E7*M7*(O7-P7)/(Q7*R7)),0)","v":0},{"$f":"IFERROR(IF(H7=\"\",0,E7*N7*(O7-P7)/(Q7*R7)),0)","v":0},{"$f":"IFERROR(IF(H7=\"\",0,S7),0)","v":0},null,null,null,null,null,null,null,{"$f":"VLOOKUP(F7,'Lookup tables'!$D$488:$E$496,2,FALSE)","v":{"$error":"#N/A"}},{"$f":"VLOOKUP(F7,'Lookup tables'!$D$488:$K$496,MATCH(State&SelectedZone,'Lookup tables'!$D$487:$K$487,0),FALSE)","v":{"$error":"#N/A"}},{"$f":"INDEX('Lookup tables'!L$488:L$496,MATCH(Misc!F7,Orientation,0))","v":{"$error":"#N/A"}},{"$f":"VLOOKUP(G7,'Lookup tables'!$O$488:$P$493,2,FALSE)","v":{"$error":"#N/A"}},{"$f":"H7","v":0},3413,{"$f":"VLOOKUP(I7,'Lookup tables'!$R$488:$S$492,2,FALSE)","v":{"$error":"#N/A"}},{"$f":"E7*L7*(O7-P7)/(Q7*R7)","v":{"$error":"#N/A"}}]
[null,{"$f":"IFERROR(IF(H8=\"\",0,E8*M8*(O8-P8)/(Q8*R8)),0)","v":0},{"$f":"IFERROR(IF(H8=\"\",0,E8*N8*(O8-P8)/(Q8*R8)),0)","v":0},{"$f":"IFERROR(IF(H8=\"\",0,S8),0)","v":0},null,null,null,null,null,null,null,{"$f":"VLOOKUP(F8,'Lookup tables'!$D$488:$E$496,2,FALSE)","v":{"$error":"#N/A"}},{"$f":"VLOOKUP(F8,'Lookup tables'!$D$488:$K$496,MATCH(State&SelectedZone,'Lookup tables'!$D$487:$K$487,0),FALSE)","v":{"$error":"#N/A"}},{"$f":"INDEX('Lookup tables'!L$488:L$496,MATCH(Misc!F8,Orientation,0))","v":{"$error":"#N/A"}},{"$f":"VLOOKUP(G8,'Lookup tables'!$O$488:$P$493,2,FALSE)","v":{"$error":"#N/A"}},{"$f":"H8","v":0},3413,{"$f":"VLOOKUP(I8,'Lookup tables'!$R$488:$S$492,2,FALSE)","v":{"$error":"#N/A"}},{"$f":"E8*L8*(O8-P8)/(Q8*R8)","v":{"$error":"#N/A"}}]
[null,{"$f":"IFERROR(IF(H9=\"\",0,E9*M9*(O9-P9)/(Q9*R9)),0)","v":0},{"$f":"IFERROR(IF(H9=\"\",0,E9*N9*(O9-P9)/(Q9*R9)),0)","v":0},{"$f":"IFERROR(IF(H9=\"\",0,S9),0)","v":0},null,null,null,null,null,null,null,{"$f":"VLOOKUP(F9,'Lookup tables'!$D$488:$E$496,2,FALSE)","v":{"$error":"#N/A"}},{"$f":"VLOOKUP(F9,'Lookup tables'!$D$488:$K$496,MATCH(State&SelectedZone,'Lookup tables'!$D$487:$K$487,0),FALSE)","v":{"$error":"#N/A"}},{"$f":"INDEX('Lookup tables'!L$488:L$496,MATCH(Misc!F9,Orientation,0))","v":{"$error":"#N/A"}},{"$f":"VLOOKUP(G9,'Lookup tables'!$O$488:$P$493,2,FALSE)","v":{"$error":"#N/A"}},{"$f":"H9","v":0},3413,{"$f":"VLOOKUP(I9,'Lookup tables'!$R$488:$S$492,2,FALSE)","v":{"$error":"#N/A"}},{"$f":"E9*L9*(O9-P9)/(Q9*R9)","v":{"$error":"#N/A"}}]
[null,{"$f":"SUM(B5:B9)","v":0},{"$f":"SUM(C5:C9)","v":0},{"$f":"SUM(D5:D9)","v":0},"Eligibility Criteria:","·Existing windows must be single pane\n·No existing solar films or solar screens",null,"·Must not be shaded by exterior awnings, curtains, or overhangs"]
[null,"ENERGY STAR Roofing"]
[null,"Peak kW","NCP kW","kWh","Building Type","Total Installed Roof Area (sq ft)","Initial Solar Reflectance*","3-Year Solar Reflectance*","Baseline Insulation R-Value (or) Building Manufacture Year","Post-Retrofit Insulation R-Value^",null,"Post Lookup","Eligible?"]
[null,{"$f":"IFERROR(INDEX(INDIRECT(State&SelectedZone&SUBSTITUTE(SUBSTITUTE(E13,\" (\",\"\"),\")\",\"\")),MATCH(I13,PreRvalues,0),3+MATCH(J13,RRange1,0)),0)*F13","v":0},{"$f":"B13","v":0},{"$f":"IFERROR(INDEX(INDIRECT(State&SelectedZone&SUBSTITUTE(SUBSTITUTE(E13,\" (\",\"\"),\")\",\"\")),MATCH(I13,PreRvalues,0),MATCH(J13,RRange1,0)),0)*F13","v":0},null,null,null,null,null,null,{"$f":"IFERROR(IF(MATCH(I13,PreRvalues,0)>MATCH(J13,PreRvalues,0),\"Post-Retrofit R-Value cannot be less than Baseline R-Value.\",\"\"),\"\")","v":""},{"$f":"INDEX('Lookup tables'!C$517:C$519,MATCH(I13,PreRvalues,0))","v":{"$error":"#N/A"}},{"$f":"IF(G13<0.65,\"No\",IF(H13<0.5,\"No\",\"Yes\"))","v":"No"}]
[null,{"$f":"IFERROR(INDEX(INDIRECT(State&SelectedZone&SUBSTITUTE(SUBSTITUTE(E14,\" (\",\"\"),\")\",\"\")),MATCH(I14,PreRvalues,0),3+MATCH(J14,RRange1,0)),0)*F14","v":0},{"$f":"B14","v":0},{"$f":"IFERROR(INDEX(INDIRECT(State&SelectedZone&SUBSTITUTE(SUBSTITUTE(E14,\" (\",\"\"),\")\",\"\")),MATCH(I14,PreRvalues,0),MATCH(J14,RRange1,0)),0)*F14","v":0},null,null,null,null,null,null,{"$f":"IFERROR(IF(MATCH(I14,PreRvalues,0)>MATCH(J14,PreRvalues,0),\"Post-Retrofit R-Value cannot be less than Baseline R-Value.\",\"\"),\"\")","v":""},{"$f":"INDEX('Lookup tables'!C$517:C$519,MATCH(I14,PreRvalues,0))","v":{"$error":"#N/A"}},{"$f":"IF(G14<0.65,\"No\",IF(H14<0.5,\"No\",\"Yes\"))","v":"No"}]
[null,{"$f":"IFERROR(INDEX(INDIRECT(State&SelectedZone&SUBSTITUTE(SUBSTITUTE(E15,\" (\",\"\"),\")\",\"\")),MATCH(I15,PreRvalues,0),3+MATCH(J15,RRange1,0)),0)*F15","v":0},{"$f":"B15","v":0},{"$f":"IFERROR(INDEX(INDIRECT(State&SelectedZone&SUBSTITUTE(SUBSTITUTE(E15,\" (\",\"\"),\")\",\"\")),MATCH(I15,PreRvalues,0),MATCH(J15,RRange1,0)),0)*F15","v":0},null,null,null,null,null,null,{"$f":"IFERROR(IF(MATCH(I15,PreRvalues,0)>MATCH(J15,PreRvalues,0),\"Post-Retrofit R-Value cannot be less than Baseline R-Value.\",\"\"),\"\")","v":""},{"$f":"INDEX('Lookup tables'!C$517:C$519,MATCH(I15,PreRvalues,0))","v":{"$error":"#N/A"}},"No"]
[null,{"$f":"SUM(B13:B15)","v":0},{"$f":"SUM(C13:C15)","v":0},{"$f":"SUM(D13:D15)","v":0},"Eligibility Criteria:","·Must be Low-Slope (2:12 or less)\n·Must be directly over at least 75% conditioned space",null,"*Found on EnergyStar certification","^If only a surface layer was added, select \nPost R-Value = Baseline R-Value"]
[null,"Entrance & Exit Door Air Infiltration",null,null,null,null,null,null,null,null,null,null,null,"Winter Peak kW/ft","Summer Peak kW/ft"]
[null,"Peak kW","NCP kW","kWh","Linear Ft of Weather Stripping or Door Sweep","Gap Width (inches)","Heating Type",null,null,null,null,"Cooling kWh/ft","Heating kWh/ft"]
[null,{"$f":"MAX(N19:O19)*E19","v":0},{"$f":"B19","v":0},{"$f":"(L19+M19)*E19","v":0},null,null,null,null,null,null,null,{"$f":"IF(OR(F19=\"\",G19=\"\"),0,IFERROR(INDEX('Lookup tables'!$E$648:$AB$653,MATCH(State&SelectedZone,'Lookup tables'!$D$648:$D$653,0),MATCH(F19,DoorGap,0)),0))","v":0},{"$f":"IFERROR(IF(OR(G19=\"Gas or None\",G19=\"\",F19=\"\"),0,INDEX('Lookup tables'!$E$648:$AB$653,MATCH(State&SelectedZone,'Lookup tables'!$D$648:$D$653,0),IF(G19=\"Electric Resistance\",4,8)+MATCH(F19,DoorGap,0))),0)","v":0},{"$f":"IFERROR(IF(OR(G19=\"Gas or None\",G19=\"\",F19=\"\"),0,INDEX('Lookup tables'!$E$648:$AB$653,MATCH(State&SelectedZone,'Lookup tables'!$D$648:$D$653,0),IF(G19=\"Electric Resistance\",16,20)+MATCH(F19,DoorGap,0))),0)","v":0},{"$f":"IF(OR(F19=\"\",G19=\"\"),0,IFERROR(INDEX('Lookup tables'!$E$648:$AB$653,MATCH(State&SelectedZone,'Lookup tables'!$D$648:$D$653,0),12+MATCH(F19,DoorGap,0)),0))","v":0}]
[null,{"$f":"MAX(N20:O20)*E20","v":0},{"$f":"B20","v":0},{"$f":"(L20+M20)*E20","v":0},null,null,null,null,null,null,null,{"$f":"IF(OR(F20=\"\",G20=\"\"),0,IFERROR(INDEX('Lookup tables'!$E$648:$AB$653,MATCH(State&SelectedZone,'Lookup tables'!$D$648:$D$653,0),MATCH(F20,DoorGap,0)),0))","v":0},{"$f":"IFERROR(IF(OR(G20=\"Gas or None\",G20=\"\",F20=\"\"),0,INDEX('Lookup tables'!$E$648:$AB$653,MATCH(State&SelectedZone,'Lookup tables'!$D$648:$D$653,0),IF(G20=\"Electric Resistance\",4,8)+MATCH(F20,DoorGap,0))),0)","v":0},{"$f":"IFERROR(IF(OR(G20=\"Gas or None\",G20=\"\",F20=\"\"),0,INDEX('Lookup tables'!$E$648:$AB$653,MATCH(State&SelectedZone,'Lookup tables'!$D$648:$D$653,0),IF(G20=\"Electric Resistance\",16,20)+MATCH(F20,DoorGap,0))),0)","v":0},{"$f":"IF(OR(F20=\"\",G20=\"\"),0,IFERROR(INDEX('Lookup tables'!$E$648:$AB$653,MATCH(State&SelectedZone,'Lookup tables'!$D$648:$D$653,0),12+MATCH(F20,DoorGap,0)),0))","v":0}]
[null,{"$f":"MAX(N21:O21)*E21","v":0},{"$f":"B21","v":0},{"$f":"(L21+M21)*E21","v":0},null,null,null,null,null,null,null,{"$f":"IF(OR(F21=\"\",G21=\"\"),0,IFERROR(INDEX('Lookup tables'!$E$648:$AB$653,MATCH(State&SelectedZone,'Lookup tables'!$D$648:$D$653,0),MATCH(F21,DoorGap,0)),0))","v":0},{"$f":"IFERROR(IF(OR(G21=\"Gas or None\",G21=\"\",F21=\"\"),0,INDEX('Lookup tables'!$E$648:$AB$653,MATCH(State&SelectedZone,'Lookup tables'!$D$648:$D$653,0),IF(G21=\"Electric Resistance\",4,8)+MATCH(F21,DoorGap,0))),0)","v":0},{"$f":"IFERROR(IF(OR(G21=\"Gas or None\",G21=\"\",F21=\"\"),0,INDEX('Lookup tables'!$E$648:$AB$653,MATCH(State&SelectedZone,'Lookup tables'!$D$648:$D$653,0),IF(G21=\"Electric Resistance\",16,20)+MATCH(F21,DoorGap,0))),0)","v":0},{"$f":"IF(OR(F21=\"\",G21=\"\"),0,IFERROR(INDEX('Lookup tables'!$E$648:$AB$653,MATCH(State&SelectedZone,'Lookup tables'!$D$648:$D$653,0),12+MATCH(F21,DoorGap,0)),0))","v":0}]
[null,{"$f":"SUM(B19:B21)","v":0},{"$f":"SUM(C19:C21)","v":0},{"$f":"SUM(D19:D21)","v":0},null,null,null,null,null,null,null,null,null,{"$f":"SUMPRODUCT(N19:N21,E19:E21)","v":0},{"$f":"SUMPRODUCT(O19:O21,E19:E21)","v":0}]
[null,"PC Power Management"]
[null,"Peak kW","NCP kW","kWh","Application","Equipment Type","Equipment Quantity"]
[null,{"$f":"IFERROR(G25*INDEX('Lookup tables'!G$657:R$662,MATCH(Misc!F25,PCPMEquipmentType,0),MATCH(State&SelectedZone&E25,'Lookup tables'!G$656:R$656,0)),0)","v":0},{"$f":"B25","v":0},{"$f":"IFERROR(G25*INDEX('Lookup tables'!E$657:F$662,MATCH(Misc!F25,PCPMEquipmentType,0),MATCH(E25,PCPMBldg,0)),0)","v":0}]
[null,{"$f":"IFERROR(G26*INDEX('Lookup tables'!G$657:R$662,MATCH(Misc!F26,PCPMEquipmentType,0),MATCH(State&SelectedZone&E26,'Lookup tables'!G$656:R$656,0)),0)","v":0},{"$f":"B26","v":0},{"$f":"IFERROR(G26*INDEX('Lookup tables'!E$657:F$662,MATCH(Misc!F26,PCPMEquipmentType,0),MATCH(E26,PCPMBldg,0)),0)","v":0}]
[null,{"$f":"IFERROR(G27*INDEX('Lookup tables'!G$657:R$662,MATCH(Misc!F27,PCPMEquipmentType,0),MATCH(State&SelectedZone&E27,'Lookup tables'!G$656:R$656,0)),0)","v":0},0,{"$f":"IFERROR(G27*INDEX('Lookup tables'!E$657:F$662,MATCH(Misc!F27,PCPMEquipmentType,0),MATCH(E27,PCPMBldg,0)),0)","v":0}]
[null,{"$f":"SUM(B25:B27)","v":0},0,{"$f":"SUM(D25:D27)","v":0}]
[null,"Central Domestic Hot Water (DHW) Controls",null,null,null,null,null,null,null,null,null,null,null,"Summer",null,null,"Winter"]
[null,"Peak kW","NCP kW","kWh","Building Type","Water Heater Type","Circulating Pump Size (watts)","# of Units Served",null,null,null,"kWh/pump","kWh/unit","kW/pump","kW/unit","kW Total","kW/pump","kW/unit","kW Total"]
[null,{"$f":"MAX(P31,S31)","v":0},{"$f":"B31","v":0},{"$f":"IFERROR(L31+M31*H31,0)","v":0},null,null,null,null,null,null,null,{"$f":"INDEX('Lookup tables'!F$668:F$671,MATCH(Misc!G31,DHWPumpSize,0))","v":{"$error":"#N/A"}},{"$f":"INDEX('Lookup tables'!E$676:P$681,MATCH(State&SelectedZone,'Lookup tables'!D$676:D$681,0),MATCH(Misc!F31&Misc!E31&\"kWh\",'Lookup tables'!E$675:P$675,0))","v":{"$error":"#N/A"}},{"$f":"INDEX('Lookup tables'!G$668:L$671,MATCH(Misc!G31,DHWPumpSize,0),MATCH(State&SelectedZone,'Lookup tables'!G$667:L$667,0))","v":{"$error":"#N/A"}},{"$f":"INDEX('Lookup tables'!E$676:P$681,MATCH(State&SelectedZone,'Lookup tables'!D$676:D$681,0),MATCH(Misc!F31&Misc!E31&\"kWs\",'Lookup tables'!E$675:P$675,0))","v":{"$error":"#N/A"}},{"$f":"IFERROR(H31*O31+N31,0)","v":0},{"$f":"INDEX('Lookup tables'!M$668:R$671,MATCH(Misc!G31,DHWPumpSize,0),MATCH(State&SelectedZone,'Lookup tables'!G$667:L$667,0))","v":{"$error":"#N/A"}},{"$f":"INDEX('Lookup tables'!E$676:P$681,MATCH(State&SelectedZone,'Lookup tables'!D$676:D$681,0),MATCH(Misc!F31&Misc!E31&\"kWw\",'Lookup tables'!E$675:P$675,0))","v":{"$error":"#N/A"}},{"$f":"IFERROR(H31*R31+Q31,0)","v":0}]
[null,{"$f":"MAX(P32,S32)","v":0},{"$f":"B32","v":0},{"$f":"IFERROR(L32+M32*H32,0)","v":0},null,null,null,null,null,null,null,{"$f":"INDEX('Lookup tables'!F$668:F$671,MATCH(Misc!G32,DHWPumpSize,0))","v":{"$error":"#N/A"}},{"$f":"INDEX('Lookup tables'!E$676:P$681,MATCH(State&SelectedZone,'Lookup tables'!D$676:D$681,0),MATCH(Misc!F32&Misc!E32&\"kWh\",'Lookup tables'!E$675:P$675,0))","v":{"$error":"#N/A"}},{"$f":"INDEX('Lookup tables'!G$668:L$671,MATCH(Misc!G32,DHWPumpSize,0),MATCH(State&SelectedZone,'Lookup tables'!G$667:L$667,0))","v":{"$error":"#N/A"}},{"$f":"INDEX('Lookup tables'!E$676:P$681,MATCH(State&SelectedZone,'Lookup tables'!D$676:D$681,0),MATCH(Misc!F32&Misc!E32&\"kWs\",'Lookup tables'!E$675:P$675,0))","v":{"$error":"#N/A"}},{"$f":"IFERROR(H32*O32+N32,0)","v":0},{"$f":"INDEX('Lookup tables'!M$668:R$671,MATCH(Misc!G32,DHWPumpSize,0),MATCH(State&SelectedZone,'Lookup tables'!G$667:L$667,0))","v":{"$error":"#N/A"}},{"$f":"INDEX('Lookup tables'!E$676:P$681,MATCH(State&SelectedZone,'Lookup tables'!D$676:D$681,0),MATCH(Misc!F32&Misc!E32&\"kWw\",'Lookup tables'!E$675:P$675,0))","v":{"$error":"#N/A"}},{"$f":"IFERROR(H32*R32+Q32,0)","v":0}]
[null,{"$f":"MAX(P33,S33)","v":0},0,{"$f":"IFERROR(L33+M33*H33,0)","v":0},null,null,null,null,null,null,null,{"$f":"INDEX('Lookup tables'!F$668:F$671,MATCH(Misc!G33,DHWPumpSize,0))","v":{"$error":"#N/A"}},{"$f":"INDEX('Lookup tables'!E$676:P$681,MATCH(State&SelectedZone,'Lookup tables'!D$676:D$681,0),MATCH(Misc!F33&Misc!E33&\"kWh\",'Lookup tables'!E$675:P$675,0))","v":{"$error":"#N/A"}},{"$f":"INDEX('Lookup tables'!G$668:L$671,MATCH(Misc!G33,DHWPumpSize,0),MATCH(State&SelectedZone,'Lookup tables'!G$667:L$667,0))","v":{"$error":"#N/A"}},{"$f":"INDEX('Lookup tables'!E$676:P$681,MATCH(State&SelectedZone,'Lookup tables'!D$676:D$681,0),MATCH(Misc!F33&Misc!E33&\"kWs\",'Lookup tables'!E$675:P$675,0))","v":{"$error":"#N/A"}},{"$f":"IFERROR(H33*O33+N33,0)","v":0},{"$f":"INDEX('Lookup tables'!M$668:R$671,MATCH(Misc!G33,DHWPumpSize,0),MATCH(State&SelectedZone,'Lookup tables'!G$667:L$667,0))","v":{"$error":"#N/A"}},{"$f":"INDEX('Lookup tables'!E$676:P$681,MATCH(State&SelectedZone,'Lookup tables'!D$676:D$681,0),MATCH(Misc!F33&Misc!E33&\"kWw\",'Lookup tables'!E$675:P$675,0))","v":{"$error":"#N/A"}},{"$f":"IFERROR(H33*R33+Q33,0)","v":0}]
[null,{"$f":"SUM(B31:B33)","v":0},{"$f":"SUM(C31:C33)","v":0},0,null,null,null,null,null,null,null,null,null,null,null,{"$f":"SUM(P31:P33)","v":0},null,null,{"$f":"SUM(S31:S33)","v":0}]

{"sheet":"Lookup tables","index":9,"n_rows":681,"n_cols":32,"rows_kept":681,"cut":false,"hidden":true,"merged":[[388,1,389,1],[425,10,425,15],[663,1,664,1],[485,14,485,15],[645,20,645,23],[485,17,485,18],[406,1,407,1],[654,1,655,1],[484,1,485,1],[645,24,645,27],[644,1,645,1],[645,4,645,7],[645,8,645,11],[645,12,645,15],[645,16,645,19],[303,16,303,27],[358,1,359,1],[303,1,304,1],[303,4,303,15],[185,1,186,1],[213,1,214,1],[242,1,243,1],[264,1,265,1],[135,2,136,2],[167,1,168,1],[173,1,174,1],[497,1,498,1],[484,5,484,7],[425,3,425,9],[139,1,140,1],[474,1,475,1],[484,8,484,10],[397,1,398,1],[398,4,398,6],[398,7,399,7],[193,1,194,1],[206,1,207,1],[329,1,330,1],[178,1,179,1],[1,1,2,1],[133,2,134,2],[9,1,10,1],[21,1,22,1],[32,1,33,1],[124,1,127,1],[118,1,119,1],[42,1,43,1],[67,1,68,1],[131,2,132,2]]}
[null,null,null,null,"TX","CPS","TX","CPS","TX","CPS"]
[null,"Door Gaskets",null,null,"kWh","kWh","kW","kW","NCP kW","NCP kW"]
[null,null,null,"Low Temperature",26.5,115,3.0000000000000001E-3,6.7600000000000004E-3,0,6.8900000000000003E-3]
[null,null,null,"Medium Temperature",3.5,15,4.0000000000000002E-4,1.2899999999999999E-3,0,1.32E-3]
[]
[]
[null,"CPS NCF for Refrigeration Measures:",1]
[null,"CPS CF for Refrigeration Measures:",0.98099999999999998]
[]
[null,"Night Covers for Open Vertical and Horizontal Refrigerated Display Cases",null,"Display Case","kW savings","kWh/ft savings",null,"Display Case Orientation","Display Case Temp"]
[null,null,null,"TX Vertical Low Temperature",0,{"$f":"45","v":45},null,"Vertical","Low Temperature"]
[null,null,null,"TX Horizontal Low Temperature",0,{"$f":"23","v":23},null,"Horizontal","Medium Temperature"]
[null,null,null,"TX Vertical Medium Temperature",0,{"$f":"35","v":35},null,"Semivertical"]
[null,null,null,"TX Horizontal Medium Temperature",0,{"$f":"17","v":17}]
[null,null,null,"CPS Vertical Low Temperature",2.3E-2,49]
[null,null,null,"CPS Horizontal Low Temperature",1.2E-2,25]
[null,null,null,"CPS Vertical Medium Temperature",1.7000000000000001E-2,36]
[null,null,null,"CPS Horizontal Medium Temperature",8.0000000000000002E-3,18]
[]
[]
[]
[null,"ECM Evaporator Fan Motors for Refrigerated Display Cases",null,"Representative Climate Region","Medium Temp","Low Temp","DF","Controls","%Off",null,null,"Hours",null,"Motor Eff. & Power Table"]
[null,null,null,null,"COP","COP",null,"Yes",0.46,null,null,8760,null,"Nominal Motor Size","Motor Output (W)","Shaded Pole","PSC","ECM Input (W)"]
[null,null,null,null,null,null,null,"No",0,null,null,null,null,"(1-14W)",9,50,22,14]
[null,null,null,"TX1",1.88,1.46,1,null,null,null,null,null,null,"1/40 HP (16-23W)",19.5,93,48,30]
[null,null,null,"TX2",1.77,1.37,1,null,null,null,"Refrigeration Type","DC",null,"1/20 HP (37W)",37,142,90,56]
[null,null,null,"TX5",1.74,1.35,1,null,null,null,"Medium Temperature",1,null,"1/15 HP (49W)",49,188,120,74]
[null,null,null,"TX3",1.89,1.46,1,null,null,null,"Low Temperature",0.94399999999999995,null,"1/4 HP",186.5,559,455,283]
[null,null,null,"TX4",1.77,1.37,1,null,null,null,null,null,null,"1/3 HP",248.7,714,607,377]
[null,null,null,"TXCPS",1.8,1.39,0.98099999999999998]
[]
[]
[null,"Door Heater Controls for Refrigerated Display Cases ",null,"Location","Med-Temperature",null,null,"Low-Temperature"]
[null,null,null,null,"kWh/ft","kW/ft","NCP kW/ft","kWh/ft","kW/ft","NCP kW/ft"]
[null,null,null,"TX1",364,7.0000000000000001E-3,null,668,1.4999999999999999E-2]
[null,null,null,"TX2",249,5.0000000000000001E-3,null,457,1.0999999999999999E-2]
[null,null,null,"TX5",405,8.0000000000000002E-3,null,745,1.7999999999999999E-2]
[null,null,null,"TX3",180,3.0000000000000001E-3,null,330,7.0000000000000001E-3]
[null,null,null,"TX4",137,3.0000000000000001E-3,null,251,6.0000000000000001E-3]
[null,null,null,"TXCPS",150,2E-3,2E-3,267,3.5000000000000001E-3,3.5999999999999999E-3]
[]
[]
[null,"Solid & Glass Door Reach-In Refrigerators and Freezers",null,null,"Glass",null,1,"0 < V < 15 "]
[null,null,null,"Freezer","Solid",null,2,"15 ≤ V < 30"]
[null,null,null,"Refrigerator/Cooler",null,null,3,"30 ≤ V < 50"]
[null,null,null,null,null,null,4,"V ≥ 50"]
[null,null,null,null,"kWhbase",null,"kWhee"]
[null,null,null,"key","c1","c2","c1","c2"]
[null,null,null,"Medium TemperatureSolid0 < V < 15 ",0.1,2.04,8.8999999999999996E-2,1.411]
[null,null,null,"Medium TemperatureSolid15 ≤ V < 30",0.1,2.04,3.6999999999999998E-2,2.2000000000000002]
[null,null,null,"Medium TemperatureSolid30 ≤ V < 50",0.1,2.04,5.6000000000000001E-2,1.635]
[null,null,null,"Medium TemperatureSolidV ≥ 50",0.1,2.04,0.06,1.4159999999999999]
[null,null,null,"Medium TemperatureGlass0 < V < 15 ",0.12,3.34,0.11799999999999999,1.3819999999999999]
[null,null,null,"Medium TemperatureGlass15 ≤ V < 30",0.12,3.34,0.14000000000000001,1.05]
[null,null,null,"Medium TemperatureGlass30 ≤ V < 50",0.12,3.34,8.7999999999999995E-2,2.625]
[null,null,null,"Medium TemperatureGlassV ≥ 50",0.12,3.34,0.11,1.5]
[null,null,null,"Low TemperatureSolid0 < V < 15 ",0.4,1.38,0.25,1.25]
[null,null,null,"Low TemperatureSolid15 ≤ V < 30",0.4,1.38,0.4,-1]
[null,null,null,"Low TemperatureSolid30 ≤ V < 50",0.4,1.38,0.16300000000000001,6.125]
[null,null,null,"Low TemperatureSolidV ≥ 50",0.4,1.38,0.158,6.3330000000000002]
[null,null,null,"Low TemperatureGlass0 < V < 15 ",0.75,4.0999999999999996,0.60699999999999998,0.89300000000000002]
[null,null,null,"Low TemperatureGlass15 ≤ V < 30",0.75,4.0999999999999996,0.73299999999999998,-1]
[null,null,null,"Low TemperatureGlass30 ≤ V < 50",0.75,4.0999999999999996,0.25,13.5]
[null,null,null,"Low TemperatureGlassV ≥ 50",0.75,4.0999999999999996,0.45,3.5]
[]
[]
[null,null,null,"Zero Energy Door"]
[null,"Zero-Energy Doors for Refrigerated Cases",null,null,"Peak kW","NC kW","kWh"]
[null,null,null,"TX1Medium Temperature",0.129,null,1132]
[null,null,null,"TX2Medium Temperature",0.13100000000000001,null,1143]
[null,null,null,"TX5Medium Temperature",0.13100000000000001,null,1147]
[null,null,null,"TX3Medium Temperature",0.129,null,1132]
[null,null,null,"TX4Medium Temperature",0.13100000000000001,null,1143]
[null,null,null,"TXCPSMedium Temperature",0.128,0.13100000000000001,1140]
[null,null,null,"TX1Low Temperature",0.23699999999999999,null,2074]
[null,null,null,"TX2Low Temperature",0.24,null,2101]
[null,null,null,"TX5Low Temperature",0.24099999999999999,null,2109]
[null,null,null,"TX3Low Temperature",0.23699999999999999,null,2074]
[null,null,null,"TX4Low Temperature",0.24,null,2101]
[null,null,null,"TXCPSLow Temperature",0.23499999999999999,0.23899999999999999,2095]
[]
[null,"Evaporator Fan Controls ",null,null,"DCevap","BF"]
[null,null,null,"Low Temperature",0.94,1.5]
[null,null,null,"Medium Temperature",1,1.3]
[null,null,null,"High Temperature",1,1.2]
[]
[]
[]
[null,"Electronic Defrost Control",null,"Representative Climate Region","Medium Temperature","Low Temperature","CF"]
[null,null,null,null,"EffMT","EffLT"]
[null,null,null,null,"(kW/Ton)","(kW/Ton)"]
[null,null,null,"TX1",1.86,2.41,1]
[null,null,null,"TX2",1.98,2.57,1]
[null,null,null,"TX5",2.02,2.61,1]
[null,null,null,"TX3",1.86,2.41,1]
[null,null,null,"TX4",1.98,2.57,1]
[null,null,null,"TXCPS",1.95,2.5299999999999998,0.98099999999999998]
[null,null,null,"LAMS",1.33,2.4,1]
[]
[null,"Strip Curtains",null,"Representative Climate Region","Peak kW","NC kW","kWh"]
[null,null,null,"TX1Medium Temperature",0.05,null,422]
[null,null,null,"TX2Medium Temperature",0.05,null,422]
[null,null,null,"TX5Medium Temperature",0.05,null,422]
[null,null,null,"TX3Medium Temperature",0.05,null,422]
[null,null,null,"TX4Medium Temperature",0.05,null,422]
[null,null,null,"TXCPSMedium Temperature",4.9000000000000002E-2,0.05,422]
[null,null,null,"TX1Low Temperature",0.35,null,2974]
[null,null,null,"TX2Low Temperature",0.35,null,2974]
[null,null,null,"TX5Low Temperature",0.35,null,2974]
[null,null,null,"TX3Low Temperature",0.35,null,2974]
[null,null,null,"TX4Low Temperature",0.35,null,2974]
[null,null,null,"TXCPSLow Temperature",0.34300000000000003,0.35,2974]
[null,null,null,null,null,null,null,null,"TX","CPS","TX","CPS","TX","CPS"]
[null,"High Efficiency Electric Convection Oven",null,"Oven Size","Annual Energy Savings [kWh]","Peak Demand Savings [kW]","NC Demand Savings [kW]",null,"Annual Energy Savings [kWh]",null,"Peak Demand Savings [kW]",null,"Non-Coincident Demand Savings [kW]"]
[null,null,null,"Full-Size",{"$f":"INDEX($I$115:$J$116,1,MATCH(TRM,$I$113:$J$113,0))","v":{"$error":"#N/A"}},{"$f":"INDEX($K$115:$L$116,1,MATCH(TRM,$I$113:$J$113,0))","v":{"$error":"#N/A"}},{"$f":"INDEX($M$115:$N$116,1,MATCH(TRM,$I$113:$J$113,0))","v":{"$error":"#N/A"}},null,1937,1937,0.41,0.41,0,0.442]
[null,null,null,"Half-Size",{"$f":"INDEX($I$115:$J$116,2,MATCH(TRM,$I$113:$J$113,0))","v":{"$error":"#N/A"}},{"$f":"INDEX($K$115:$L$116,2,MATCH(TRM,$I$113:$J$113,0))","v":{"$error":"#N/A"}},{"$f":"INDEX($M$115:$N$116,2,MATCH(TRM,$I$113:$J$113,0))","v":{"$error":"#N/A"}},null,192,192,0.04,4.1000000000000002E-2,0,4.3999999999999997E-2]
[]
[]
[null,"High Efficiency Electric Combination Oven",null,"TRM","Annual Energy Savings [kWh]","Peak Demand Savings [kW]","NC Demand Savings [kW]"]
[null,null,null,"TX",6368,1.3460000000000001,0]
[null,null,null,"CPS",6368,1.3460000000000001,1.454]
[]
[]
[]
[null,"ENERGY STAR Commercial Dishwashers",null,"Facility Description","Under Counter","Under Counter","Under Counter","Door Type","Door Type","Door Type","Single Tank Conveyor","Single Tank Conveyor","Single Tank Conveyor","Multi Tank Conveyor","Multi Tank Conveyor","Multi Tank Conveyor","Pot, Pan and Utensil","Pot, Pan and Utensil","Pot, Pan and Utensil",null,"Under Counter"]
[null,null,null,null,"kWh","Peak kW","NC kW","kWh","Peak kW","NC kW","kWh","Peak kW","NC kW","kWh","Peak kW","NC kW","kWh","Peak kW","NC kW",null,"Door Type"]
[null,null,null,null,{"$f":"E125&E126","v":"Under CounterkWh"},{"$f":"F125&F126","v":"Under CounterPeak kW"},{"$f":"G125&G126","v":"Under CounterNC kW"},"Door TypekWh","Door TypePeak kW",{"$f":"J125&J126","v":"Door TypeNC kW"},"Single Tank ConveyorkWh","Single Tank ConveyorPeak kW",{"$f":"M125&M126","v":"Single Tank ConveyorNC kW"},"Multi Tank ConveyorkWh","Multi Tank ConveyorPeak kW",{"$f":"P125&P126","v":"Multi Tank ConveyorNC kW"},"Pot, Pan and UtensilkWh","Pot, Pan and UtensilPeak kW",{"$f":"S125&S126","v":"Pot, Pan and UtensilNC kW"},null,"Single Tank Conveyor"]
[null,null,null,"Low Temp. / Electric Hot Water Heater",{"$f":"INDEX(E$132:E$133,MATCH(TRM,$D$132:$D$133,0))","v":{"$error":"#N/A"}},{"$error":"#N/A"},{"$error":"#N/A"},{"$error":"#N/A"},{"$error":"#N/A"},{"$error":"#N/A"},{"$error":"#N/A"},{"$error":"#N/A"},{"$error":"#N/A"},{"$error":"#N/A"},{"$error":"#N/A"},{"$error":"#N/A"},{"$error":"#N/A"},{"$error":"#N/A"},{"$error":"#N/A"},null,"Multi Tank Conveyor"]
[null,null,null,"High Temp. / Electric Hot Water Heater w/ Electric Booster Heater",{"$f":"INDEX(E$134:E$135,MATCH(TRM,$D$132:$D$133,0))","v":{"$error":"#N/A"}},{"$error":"#N/A"},{"$error":"#N/A"},{"$error":"#N/A"},{"$error":"#N/A"},{"$error":"#N/A"},{"$error":"#N/A"},{"$error":"#N/A"},{"$error":"#N/A"},{"$error":"#N/A"},{"$error":"#N/A"},{"$error":"#N/A"},{"$error":"#N/A"},{"$error":"#N/A"},{"$error":"#N/A"},null,"Pot, Pan and Utensil"]
[null,null,null,"High Temp. / Gas Hot Water Heater w/ Electric Booster Heater",{"$f":"INDEX(E$136:E$137,MATCH(TRM,$D$132:$D$133,0))","v":{"$error":"#N/A"}},{"$error":"#N/A"},{"$error":"#N/A"},{"$error":"#N/A"},{"$error":"#N/A"},{"$error":"#N/A"},{"$error":"#N/A"},{"$error":"#N/A"},{"$error":"#N/A"},{"$error":"#N/A"},{"$error":"#N/A"},{"$error":"#N/A"},{"$error":"#N/A"},{"$error":"#N/A"},{"$error":"#N/A"}]
[]
[null,null,"Low Temp. / Electric Hot Water Heater","TX",2540,0.375,0,16153,2.3849999999999998,0,13626,2.012,0,18811,2.7770000000000001,0,0,0,0]
[null,null,null,"CPS",2540,0.29199999999999998,0.38700000000000001,16153,1.8560000000000001,2.4590000000000001,13626,1.5660000000000001,2.0739999999999998,18811,2.1619999999999999,2.863,0,0,0]
[null,null,"High Temp. / Electric Hot Water Heater w/ Electric Booster Heater","TX",3171,0.46800000000000003,0,11863,1.7509999999999999,0,9212,1.36,0,27408,4.0460000000000003,0,3311,0.48899999999999999,0]
[null,null,null,"CPS",3171,0.36399999999999999,0.48299999999999998,11863,1.363,1.806,9212,1.0589999999999999,1.4019999999999999,27408,3.15,4.1719999999999997,3311,0.38,0.504]
[null,null,"High Temp. / Gas Hot Water Heater w/ Electric Booster Heater","TX",2089,0.308,0,4840,0.71499999999999997,0,4948,0.73,0,11230,1.6579999999999999,0,1204,0.17799999999999999,0]
[null,null,null,"CPS",2089,0.24,0.318,4840,0.55600000000000005,0.73699999999999999,4948,0.56899999999999995,0.753,11230,1.2909999999999999,1.7090000000000001,1204,0.13800000000000001,0.183]
[]
[]
[null,"ENERGY STAR Electric Steam Cookers"]
[]
[null,null,null,"Boiler Based","3-Pan"]
[null,null,null,"Steam Generator","4-Pan"]
[null,null,null,null,"5-Pan"]
[null,null,null,null,"6-Pan or larger"]
[]
[null,null,null,"Lookup","kWh","Peak kW","NC kW"]
[null,null,null,"TXBoiler Based3-Pan",11784,2.4750000000000001]
[null,null,null,"TXBoiler Based4-Pan",14553,3.0569999999999999]
[null,null,null,"TXBoiler Based5-Pan",17268,3.6269999999999998]
[null,null,null,"TXBoiler Based6-Pan or larger",19990,4.1989999999999998]
[null,null,null,"TXSteam Generator3-Pan",9967,2.093]
[null,null,null,"TXSteam Generator4-Pan",12107,2.5430000000000001]
[null,null,null,"TXSteam Generator5-Pan",14186,2.98]
[null,null,null,"TXSteam Generator6-Pan or larger",16270,3.4169999999999998]
[null,null,null,"CPSBoiler Based3-Pan",11784,2.4910000000000001,2.69]
[null,null,null,"CPSBoiler Based4-Pan",14553,3.077,3.323]
[null,null,null,"CPSBoiler Based5-Pan",17268,3.6509999999999998,3.9420000000000002]
[null,null,null,"CPSBoiler Based6-Pan or larger",19990,4.226,4.5640000000000001]
[null,null,null,"CPSSteam Generator3-Pan",9967,2.1070000000000002,2.2759999999999998]
[null,null,null,"CPSSteam Generator4-Pan",12107,2.56,2.7639999999999998]
[null,null,null,"CPSSteam Generator5-Pan",14186,2.9990000000000001,3.2389999999999999]
[null,null,null,"CPSSteam Generator6-Pan or larger",16270,3.44,3.7149999999999999]
[]
[]
[]
[null,null,null,null,null,null,null,null,"TX","CPS","TX","CPS","TX","CPS"]
[null,"ENERGY STAR Commercial Electric Hot Food Holding Cabinet",null,"Size","Annual Energy Savings [kWh]","Peak Demand Savings [kW]","NC Demand Savings [kW]",null,"Annual Energy Savings [kWh]",null,"Peak Demand Savings [kW]",null,"NC Demand Savings [kW]"]
[null,null,null,"Half",{"$f":"INDEX(I169:J169,1,MATCH(TRM,$I$167:$J$167,0))","v":{"$error":"#N/A"}},{"$f":"INDEX(K169:L169,1,MATCH(TRM,$I$167:$J$167,0))","v":{"$error":"#N/A"}},{"$f":"INDEX(M169:N169,1,MATCH(TRM,$I$167:$J$167,0))","v":{"$error":"#N/A"}},null,1215,1215,0.20399999999999999,0.20499999999999999,0,0.222]
[null,null,null,"Three-Quarter",{"$f":"INDEX(I170:J170,1,MATCH(TRM,$I$167:$J$167,0))","v":{"$error":"#N/A"}},{"$f":"INDEX(K170:L170,1,MATCH(TRM,$I$167:$J$167,0))","v":{"$error":"#N/A"}},{"$f":"INDEX(M170:N170,1,MATCH(TRM,$I$167:$J$167,0))","v":{"$error":"#N/A"}},null,2770,2770,0.46600000000000003,0.46800000000000003,0,0.50600000000000001]
[null,null,null,"Full",{"$f":"INDEX(I171:J171,1,MATCH(TRM,$I$167:$J$167,0))","v":{"$error":"#N/A"}},{"$f":"INDEX(K171:L171,1,MATCH(TRM,$I$167:$J$167,0))","v":{"$error":"#N/A"}},{"$f":"INDEX(M171:N171,1,MATCH(TRM,$I$167:$J$167,0))","v":{"$error":"#N/A"}},null,4832,4832,0.81200000000000006,0.81699999999999995,0,0.88300000000000001]
[]
[null,null,null,null,null,null,null,null,"TX","CPS","TX","CPS","TX","CPS"]
[null,"ENERGY STAR Electric Fryer",null,"Fryer Type","Annual Energy Savings [kWh]","Peak Demand Savings [kW]","NC Demand Savings [kW]",null,"Annual Energy Savings [kWh]",null,"Peak Demand Savings [kW]",null,"NC Demand Savings [kW]"]
[null,null,null,"Standard",{"$f":"INDEX(I175:J175,1,MATCH(TRM,$I$173:$J$173,0))","v":{"$error":"#N/A"}},{"$f":"INDEX(K175:L175,1,MATCH(TRM,$I$173:$J$173,0))","v":{"$error":"#N/A"}},{"$f":"INDEX(M175:N175,1,MATCH(TRM,$I$173:$J$173,0))","v":{"$error":"#N/A"}},null,2376,2376,0.374,0.377,0,0.40699999999999997]
[null,null,null,"Large Vat",{"$f":"INDEX(I176:J176,1,MATCH(TRM,$I$173:$J$173,0))","v":{"$error":"#N/A"}},{"$f":"INDEX(K176:L176,1,MATCH(TRM,$I$173:$J$173,0))","v":{"$error":"#N/A"}},{"$f":"INDEX(M176:N176,1,MATCH(TRM,$I$173:$J$173,0))","v":{"$error":"#N/A"}},null,2497,2536,0.52500000000000002,0.53600000000000003,0,0.57899999999999996]
[]
[null,null,null,null,null,null,null,null,"TX","CPS","TX","CPS","TX","CPS"]
[null,"Vending Machine Controls",null,"Type of Machine","Annual (kWh) Savings","Peak demand (kW) Savings","NC Demand Savings [kW]",null,"Annual Energy Savings [kWh]",null,"Peak Demand Savings [kW]",null,"NC Demand Savings [kW]"]
[null,null,null,"Refrigerated Cold Drink Unit (cans or bottles)",{"$f":"INDEX(I180:J180,1,MATCH(TRM,$I$178:$J$178,0))","v":{"$error":"#N/A"}},{"$f":"INDEX(K180:L180,1,MATCH(TRM,$I$178:$J$178,0))","v":{"$error":"#N/A"}},{"$f":"INDEX(M180:N180,1,MATCH(TRM,$I$178:$J$178,0))","v":{"$error":"#N/A"}},null,1612,1612,0.03,4.2000000000000003E-2,0,0.42299999999999999]
[null,null,null,"Refrigerated Reach-in Unit (any sealed beverage)",{"$f":"INDEX(I181:J181,1,MATCH(TRM,$I$178:$J$178,0))","v":{"$error":"#N/A"}},{"$f":"INDEX(K181:L181,1,MATCH(TRM,$I$178:$J$178,0))","v":{"$error":"#N/A"}},{"$f":"INDEX(M181:N181,1,MATCH(TRM,$I$178:$J$178,0))","v":{"$error":"#N/A"}},null,1086,1086,3.5000000000000003E-2,2.9000000000000001E-2,0,0.28499999999999998]
[null,null,null,"Non-Refrigerated Snack Unit with lighting (incl. warm beverage)",{"$f":"INDEX(I182:J182,1,MATCH(TRM,$I$178:$J$178,0))","v":{"$error":"#N/A"}},{"$f":"INDEX(K182:L182,1,MATCH(TRM,$I$178:$J$178,0))","v":{"$error":"#N/A"}},{"$f":"INDEX(M182:N182,1,MATCH(TRM,$I$178:$J$178,0))","v":{"$error":"#N/A"}},null,387,387,6.0000000000000001E-3,0.01,0,0.10199999999999999]
[]
[]
[null,null,null,null,null,null,null,null,"TX","CPS","TX","CPS","TX","CPS"]
[null,"Low Flow Pre-Rinse Spray Valve Electric and Gas (direct install/point of sale)",null,"Building Type","kWh Savings (Annual)","kW Peak Demand Savings","kW NC Peak Demand Savings",null,"Annual Energy Savings [kWh]",null,"Peak Demand Savings [kW]",null,"NC Demand Savings [kW]"]
[null,null,null,"Fast Food Restaurant",{"$f":"INDEX(I187:J187,1,MATCH(TRM,$I$185:$J$185,0))","v":{"$error":"#N/A"}},{"$f":"INDEX(K187:L187,1,MATCH(TRM,$I$185:$J$185,0))","v":{"$error":"#N/A"}},{"$f":"INDEX(M187:N187,1,MATCH(TRM,$I$185:$J$185,0))","v":{"$error":"#N/A"}},null,706,625,0.13400000000000001,7.0000000000000007E-2,0,0.13]
[null,null,null,"Casual Dining",{"$f":"INDEX(I188:J188,1,MATCH(TRM,$I$185:$J$185,0))","v":{"$error":"#N/A"}},{"$f":"INDEX(K188:L188,1,MATCH(TRM,$I$185:$J$185,0))","v":{"$error":"#N/A"}},{"$f":"INDEX(M188:N188,1,MATCH(TRM,$I$185:$J$185,0))","v":{"$error":"#N/A"}},null,1647,1458,0.749,0.25,0,0.76]
[null,null,null,"Institutional",{"$f":"INDEX(I189:J189,1,MATCH(TRM,$I$185:$J$185,0))","v":{"$error":"#N/A"}},{"$f":"INDEX(K189:L189,1,MATCH(TRM,$I$185:$J$185,0))","v":{"$error":"#N/A"}},{"$f":"INDEX(M189:N189,1,MATCH(TRM,$I$185:$J$185,0))","v":{"$error":"#N/A"}},null,3295,2916,0.53500000000000003,0.28999999999999998,0,0.94]
[null,null,null,"Dormitory",{"$f":"INDEX(I190:J190,1,MATCH(TRM,$I$185:$J$185,0))","v":{"$error":"#N/A"}},{"$f":"INDEX(K190:L190,1,MATCH(TRM,$I$185:$J$185,0))","v":{"$error":"#N/A"}},{"$f":"INDEX(M190:N190,1,MATCH(TRM,$I$185:$J$185,0))","v":{"$error":"#N/A"}},null,2471,2187,1.589,0.26,0,0.87]
[null,null,null,"School",{"$f":"INDEX(I191:J191,1,MATCH(TRM,$I$185:$J$185,0))","v":{"$error":"#N/A"}},{"$f":"INDEX(K191:L191,1,MATCH(TRM,$I$185:$J$185,0))","v":{"$error":"#N/A"}},{"$f":"INDEX(M191:N191,1,MATCH(TRM,$I$185:$J$185,0))","v":{"$error":"#N/A"}},null,883,782,0.51900000000000002,0.28000000000000003,0,0.87]
[]
[]
[null,"Aerators",null,"Water Heater Type","Water Heater Eff","TS"]
[null,null,null,"Electric Resistance",0.98,{"$f":"INDEX(I198:I198,1,MATCH(State&SelectedZone,I197:I197,0))","v":{"$error":"#N/A"}}]
[null,null,null,"Heat pump Water Heater",2.2000000000000002]
[null,null,null,null,null,null,null,null,"TXCPS"]
[null,null,null,"Building Type","U","Days","P",null,75.900000000000006]
[null,null,null,"Prison",30,365,0.04]
[null,null,null,"Hospital/Nursing Home",3,365,0.03]
[null,null,null,"Dormitory",30,274,0.04]
[null,null,null,"Multifamily",3,365,0.03]
[null,null,null,"Lodging",3,365,0.02]
[null,null,null,"Commercial",30,250,0.08]
[null,null,null,"School",30,200,0.05]
[]
[null,"Showerheads",null,"Building Type","Days","N","P",null,"State","TXCPS"]
[null,null,null,"Hospital/Nursing Home",365,0.89,0.03,null,"Fhw",0.66900000000000004]
[null,null,null,"Hospitality",365,1.25,0.02,null,{"$f":"INDEX(J208:J208,1,MATCH(State&SelectedZone,J207:J207,0))","v":{"$error":"#N/A"}}]
[null,null,null,"Commercial",250,0.97,0.08]
[null,null,null,"24-Hour Fitness Center",365,19.940000000000001,0.08]
[null,null,null,"School",200,1.32,0.05]
[]
[null,"DCV Kitchen Ventilation"]
[]
[null,null,null,"Zone","Building Type","ER Heat","HP Heat","Cooling","AvgSav kWh/HP","Hrs/Day","Days/Yr","MAU factor w/ no MAU","Summer PWPLS","Winter PWPLS"]
[null,null,null,"TX1","Casual Dining/Fast Food",4264,1890,315,0.65,15,365,0.65,1.3300000000000001E-4,1.46E-4]
[null,null,null,"TX1","24-Hr Restaurant/Hotel",10962,4858,441,0.63100000000000001,24,365,0.65,1.3300000000000001E-4,1.46E-4]
[null,null,null,"TX1","School Cafe with summer",3296,1460,235,0.56599999999999995,11,325,0.51,1.3300000000000001E-4,1.46E-4]
[null,null,null,"TX1","School Cafe without summer",3289,1457,107,0.56599999999999995,11,252,0.51,1.3300000000000001E-4,1.46E-4]
[null,null,null,"TX2","Casual Dining/Fast Food",2467,1093,581,0.65,15,365,0.65,1.36E-4,1.45E-4]
[null,null,null,"TX2","24-Hr Restaurant/Hotel",6385,2829,910,0.63100000000000001,24,365,0.65,1.36E-4,1.45E-4]
[null,null,null,"TX2","School Cafe with summer",1912,847,434,0.56599999999999995,11,325,0.51,1.36E-4,1.45E-4]
[null,null,null,"TX2","School Cafe without summer",1912,847,211,0.56599999999999995,11,252,0.51,1.36E-4,1.45E-4]
[null,null,null,"TX3","Casual Dining/Fast Food",1669,740,616,0.65,15,365,0.65,1.34E-4,1.4300000000000001E-4]
[null,null,null,"TX3","24-Hr Restaurant/Hotel",4593,2035,954,0.63100000000000001,24,365,0.65,1.34E-4,1.4300000000000001E-4]
[null,null,null,"TX3","School Cafe with summer",1282,568,496,0.56599999999999995,11,325,0.51,1.34E-4,1.4300000000000001E-4]
[null,null,null,"TX3","School Cafe without summer",1281,568,296,0.56599999999999995,11,252,0.51,1.34E-4,1.4300000000000001E-4]
[null,null,null,"TX4","Casual Dining/Fast Food",1019,452,721,0.65,15,365,0.65,1.3100000000000001E-4,1.45E-4]
[null,null,null,"TX4","24-Hr Restaurant/Hotel",2971,1316,1171,0.63100000000000001,24,365,0.65,1.3100000000000001E-4,1.45E-4]
[null,null,null,"TX4","School Cafe with summer",776,344,579,0.56599999999999995,11,325,0.51,1.3100000000000001E-4,1.45E-4]
[null,null,null,"TX4","School Cafe without summer",776,344,357,0.56599999999999995,11,252,0.51,1.3100000000000001E-4,1.45E-4]
[null,null,null,"TX5","Casual Dining/Fast Food",2094,928,529,0.65,15,365,0.65,1.45E-4,1.46E-4]
[null,null,null,"TX5","24-Hr Restaurant/Hotel",6240,2765,782,0.63100000000000001,24,365,0.65,1.45E-4,1.46E-4]
[null,null,null,"TX5","School Cafe with summer",1666,738,401,0.56599999999999995,11,325,0.51,1.45E-4,1.46E-4]
[null,null,null,"TX5","School Cafe without summer",1663,737,233,0.56599999999999995,11,252,0.51,1.45E-4,1.46E-4]
[null,"Used TX3 for CPS",null,"TXCPS","Casual Dining/Fast Food",1669,740,616,0.65,15,365,0.65]
[null,null,null,"TXCPS","24-Hr Restaurant/Hotel",4593,2035,954,0.63100000000000001,24,365,0.65]
[null,null,null,"TXCPS","School Cafe with summer",1282,568,496,0.56599999999999995,11,325,0.51]
[null,null,null,"TXCPS","School Cafe without summer",1281,568,296,0.56599999999999995,11,252,0.51]
[]
[]
[null,"Commercial Ice Makers",null,"Equipment Type","Operation","Harvest Rate (lbs/24 hrs, min of range)","Base Energy Use Const","Base Energy Use Multiplier"]
[null,null,null,"Ice Making Head","Batch",0,10,-1.2330000000000001E-2]
[null,null,null,null,null,300,7.05,-2.5000000000000001E-3]
[null,null,null,null,null,800,5.55,-6.3000000000000003E-4]
[null,"Ice Making Head",null,null,null,1500,4.6100000000000003,0]
[null,"Remote Condensing Unit",null,"Remote Condensing Unit","Batch",0,7.97,-3.4199999999999999E-3]
[null,"Self Contained Unit",null,null,null,988,4.59,0]
[null,null,null,"Self Contained Unit","Batch",0,14.79,-4.6899999999999997E-2]
[null,null,null,null,null,110,12.42,-2.5329999999999998E-2]
[null,null,null,null,null,200,7.35,0]
[null,null,null,"Ice Making Head","Continuous",0,9.19,-6.2899999999999996E-3]
[null,null,null,null,null,310,8.23,-3.2000000000000002E-3]
[null,null,null,null,null,820,5.61,0]
[null,null,null,"Remote Condensing Unit","Continuous",0,9.6999999999999993,-5.7999999999999996E-3]
[null,null,null,null,null,800,5.0599999999999996,0]
[null,null,null,"Self Contained Unit","Continuous",0,14.22,-0.03]
[null,null,null,null,null,200,9.4700000000000006,-6.1999999999999998E-3]
[null,null,null,null,null,700,5.0999999999999996,0]
[]
[null,null,null,null,null,null,"Savings per motor HP"]
[null,null,null,null,null,null,"Hospitals & Healthcare","Office—Large","Office—Small","Education—K-12","Education—College & University","Retail","Restaurants—Fast Food","Restaurants—Sit Down","Hospitals & Healthcare","Office—Large","Office—Small","Education—K-12","Education—College & University","Retail","Restaurants—Fast Food","Restaurants—Sit Down"]
[null,null,null,"State & Zone","Application","Pre Control Type","kWh","kWh","kWh","kWh","kWh","kWh","kWh","kWh","kW","kW","kW","kW","kW","kW","kW","kW"]
[null,"HVAC VFD's",null,"TX1","AHU Supply Fan","Outlet Damper",1160,569,514,539,590,710,872,674,4.1000000000000002E-2,4.1000000000000002E-2,4.1000000000000002E-2,4.1000000000000002E-2,4.1000000000000002E-2,4.1000000000000002E-2,4.1000000000000002E-2,4.1000000000000002E-2]
[null,null,null,"TX2","AHU Supply Fan","Outlet Damper",1101,536,484,508,555,668,823,635,3.2000000000000001E-2,3.2000000000000001E-2,3.2000000000000001E-2,3.2000000000000001E-2,3.2000000000000001E-2,3.2000000000000001E-2,3.2000000000000001E-2,3.2000000000000001E-2]
[null,null,null,"TX3","AHU Supply Fan","Outlet Damper",1071,515,464,484,533,645,796,617,3.7999999999999999E-2,3.7999999999999999E-2,3.7999999999999999E-2,3.7999999999999999E-2,3.7999999999999999E-2,3.7999999999999999E-2,3.7999999999999999E-2,3.7999999999999999E-2]
[null,null,null,"TX4","AHU Supply Fan","Outlet Damper",1046,499,449,469,517,629,776,603,6.0999999999999999E-2,6.0999999999999999E-2,6.0999999999999999E-2,6.0999999999999999E-2,6.0999999999999999E-2,6.0999999999999999E-2,6.0999999999999999E-2,6.0999999999999999E-2]
[null,null,null,"TX5","AHU Supply Fan","Outlet Damper",1121,545,493,517,565,680,838,646,4.1000000000000002E-2,4.1000000000000002E-2,4.1000000000000002E-2,4.1000000000000002E-2,4.1000000000000002E-2,4.1000000000000002E-2,4.1000000000000002E-2,4.1000000000000002E-2]
[null,"AHU Supply Fan",null,"TXCPS","AHU Supply Fan","Outlet Damper",1071,515,464,484,533,645,796,617,3.7999999999999999E-2,3.7999999999999999E-2,3.7999999999999999E-2,3.7999999999999999E-2,3.7999999999999999E-2,3.7999999999999999E-2,3.7999999999999999E-2,3.7999999999999999E-2]
[null,"Chilled Water Pump",null,"TX1","AHU Supply Fan","Inlet Damper",1824,881,797,837,914,1098,1358,1044,4.7E-2,4.7E-2,4.7E-2,4.7E-2,4.7E-2,4.7E-2,4.7E-2,4.7E-2]
[null,"Hot Water Pump",null,"TX2","AHU Supply Fan","Inlet Damper",1672,801,724,761,830,998,1238,949,3.6999999999999998E-2,3.6999999999999998E-2,3.6999999999999998E-2,3.6999999999999998E-2,3.6999999999999998E-2,3.6999999999999998E-2,3.6999999999999998E-2,3.6999999999999998E-2]
[null,null,null,"TX3","AHU Supply Fan","Inlet Damper",1597,754,678,709,780,944,1172,906,4.7E-2,4.7E-2,4.7E-2,4.7E-2,4.7E-2,4.7E-2,4.7E-2,4.7E-2]
[null,"Outlet Damper",null,"TX4","AHU Supply Fan","Inlet Damper",1533,716,643,673,741,904,1122,870,6.7000000000000004E-2,6.7000000000000004E-2,6.7000000000000004E-2,6.7000000000000004E-2,6.7000000000000004E-2,6.7000000000000004E-2,6.7000000000000004E-2,6.7000000000000004E-2]
[null,"Inlet Damper",null,"TX5","AHU Supply Fan","Inlet Damper",1722,822,743,782,852,1024,1272,974,4.7E-2,4.7E-2,4.7E-2,4.7E-2,4.7E-2,4.7E-2,4.7E-2,4.7E-2]
[null,"Inlet Guide Vane",null,"TXCPS","AHU Supply Fan","Inlet Damper",1597,754,678,709,780,944,1172,906,4.7E-2,4.7E-2,4.7E-2,4.7E-2,4.7E-2,4.7E-2,4.7E-2,4.7E-2]
[null,"No Control",null,"TX1","AHU Supply Fan","Inlet Guide Vane",388,185,167,176,192,230,286,219,8.9999999999999993E-3,8.9999999999999993E-3,8.9999999999999993E-3,8.9999999999999993E-3,8.9999999999999993E-3,8.9999999999999993E-3,8.9999999999999993E-3,8.9999999999999993E-3]
[null,null,null,"TX2","AHU Supply Fan","Inlet Guide Vane",345,163,148,156,169,203,253,194,8.9999999999999993E-3,8.9999999999999993E-3,8.9999999999999993E-3,8.9999999999999993E-3,8.9999999999999993E-3,8.9999999999999993E-3,8.9999999999999993E-3,8.9999999999999993E-3]
[null,"Hospitals & Healthcare",null,"TX3","AHU Supply Fan","Inlet Guide Vane",324,151,135,142,156,189,236,182,0.01,0.01,0.01,0.01,0.01,0.01,0.01,0.01]
[null,"Office—Large",null,"TX4","AHU Supply Fan","Inlet Guide Vane",307,141,126,132,145,178,222,172,1.0999999999999999E-2,1.0999999999999999E-2,1.0999999999999999E-2,1.0999999999999999E-2,1.0999999999999999E-2,1.0999999999999999E-2,1.0999999999999999E-2,1.0999999999999999E-2]
[null,"Office—Small",null,"TX5","AHU Supply Fan","Inlet Guide Vane",359,169,153,161,175,210,262,200,0.01,0.01,0.01,0.01,0.01,0.01,0.01,0.01]
[null,"Education—K-12",null,"TXCPS","AHU Supply Fan","Inlet Guide Vane",324,151,135,142,156,189,236,182,0.01,0.01,0.01,0.01,0.01,0.01,0.01,0.01]
[null,"Education—College & University",null,"TX1","AHU Supply Fan","No Control",3300,1595,1442,1514,1654,1988,2458,1889,4.9000000000000002E-2,4.9000000000000002E-2,4.9000000000000002E-2,4.9000000000000002E-2,4.9000000000000002E-2,4.9000000000000002E-2,4.9000000000000002E-2,4.9000000000000002E-2]
[null,"Retail",null,"TX2","AHU Supply Fan","No Control",3035,1453,1313,1380,1505,1809,2245,1720,3.6999999999999998E-2,3.6999999999999998E-2,3.6999999999999998E-2,3.6999999999999998E-2,3.6999999999999998E-2,3.6999999999999998E-2,3.6999999999999998E-2,3.6999999999999998E-2]
[null,"Restaurants—Fast Food",null,"TX3","AHU Supply Fan","No Control",2904,1368,1228,1285,1414,1712,2128,1644,6.0999999999999999E-2,6.0999999999999999E-2,6.0999999999999999E-2,6.0999999999999999E-2,6.0999999999999999E-2,6.0999999999999999E-2,6.0999999999999999E-2,6.0999999999999999E-2]
[null,"Restaurants—Sit Down",null,"TX4","AHU Supply Fan","No Control",2792,1299,1165,1219,1344,1640,2040,1579,8.5999999999999993E-2,8.5999999999999993E-2,8.5999999999999993E-2,8.5999999999999993E-2,8.5999999999999993E-2,8.5999999999999993E-2,8.5999999999999993E-2,8.5999999999999993E-2]
[null,null,null,"TX5","AHU Supply Fan","No Control",3124,1490,1348,1418,1545,1857,2307,1765,5.0999999999999997E-2,5.0999999999999997E-2,5.0999999999999997E-2,5.0999999999999997E-2,5.0999999999999997E-2,5.0999999999999997E-2,5.0999999999999997E-2,5.0999999999999997E-2]
[null,null,null,"TXCPS","AHU Supply Fan","No Control",2904,1368,1228,1285,1414,1712,2128,1644,6.0999999999999999E-2,6.0999999999999999E-2,6.0999999999999999E-2,6.0999999999999999E-2,6.0999999999999999E-2,6.0999999999999999E-2,6.0999999999999999E-2,6.0999999999999999E-2]
[null,null,null,"TX1","Chilled Water Pump",null,777,455,411,422,475,576,662,540,4.5999999999999999E-2,4.5999999999999999E-2,4.5999999999999999E-2,4.5999999999999999E-2,4.5999999999999999E-2,4.5999999999999999E-2,4.5999999999999999E-2,4.5999999999999999E-2]
[null,null,null,"TX2","Chilled Water Pump",null,1154,621,560,577,644,780,924,736,2.9000000000000001E-2,2.9000000000000001E-2,2.9000000000000001E-2,2.9000000000000001E-2,2.9000000000000001E-2,2.9000000000000001E-2,2.9000000000000001E-2,2.9000000000000001E-2]
[null,null,null,"TX3","Chilled Water Pump",null,1337,699,633,655,727,888,1057,837,3.5000000000000003E-2,3.5000000000000003E-2,3.5000000000000003E-2,3.5000000000000003E-2,3.5000000000000003E-2,3.5000000000000003E-2,3.5000000000000003E-2,3.5000000000000003E-2]
[null,null,null,"TX4","Chilled Water Pump",null,1479,758,683,710,788,958,1152,908,8.6999999999999994E-2,8.6999999999999994E-2,8.6999999999999994E-2,8.6999999999999994E-2,8.6999999999999994E-2,8.6999999999999994E-2,8.6999999999999994E-2,8.6999999999999994E-2]
[null,null,null,"TX5","Chilled Water Pump",null,1049,590,533,549,613,738,868,690,4.9000000000000002E-2,4.9000000000000002E-2,4.9000000000000002E-2,4.9000000000000002E-2,4.9000000000000002E-2,4.9000000000000002E-2,4.9000000000000002E-2,4.9000000000000002E-2]
[null,null,null,"TXCPS","Chilled Water Pump",null,1337,699,633,655,727,888,1057,837,3.5000000000000003E-2,3.5000000000000003E-2,3.5000000000000003E-2,3.5000000000000003E-2,3.5000000000000003E-2,3.5000000000000003E-2,3.5000000000000003E-2,3.5000000000000003E-2]
[null,null,null,"TX1","Hot Water Pump",null,1304,600,541,572,620,746,940,710,0.123,0.123,0.123,0.123,0.123,0.123,0.123,0.123]
[null,null,null,"TX2","Hot Water Pump",null,912,417,378,399,431,510,649,487,4.4999999999999998E-2,4.4999999999999998E-2,4.4999999999999998E-2,4.4999999999999998E-2,4.4999999999999998E-2,4.4999999999999998E-2,4.4999999999999998E-2,4.4999999999999998E-2]
[null,null,null,"TX3","Hot Water Pump",null,723,323,286,301,332,397,510,386,4.7E-2,4.7E-2,4.7E-2,4.7E-2,4.7E-2,4.7E-2,4.7E-2,4.7E-2]
[null,null,null,"TX4","Hot Water Pump",null,597,257,228,239,264,321,413,314,0.108,0.108,0.108,0.108,0.108,0.108,0.108,0.108]
[null,null,null,"TX5","Hot Water Pump",null,1044,468,421,448,487,593,745,566,0.22900000000000001,0.22900000000000001,0.22900000000000001,0.22900000000000001,0.22900000000000001,0.22900000000000001,0.22900000000000001,0.22900000000000001]
[null,null,null,"TXCPS","Hot Water Pump",null,723,323,286,301,332,397,510,386,4.7E-2,4.7E-2,4.7E-2,4.7E-2,4.7E-2,4.7E-2,4.7E-2,4.7E-2]
[]
[]
[]
[null,"Evaporative Pre-Cooling",null,null,"DRF",null,null,null,null,null,null,null,null,null,null,null,"EFLHreduction",null,null,null,null,null,null,null,null,null,null,null,null,"Weather Zone","Temperature (°F)","Humidity (%)"]
[null,null,null,"Building Type","TX1DX","TX2DX","TX3DX","TX4DX","TX5DX","TXCPSDX","TX1ACC","TX2ACC","TX3ACC","TX4ACC","TX5ACC","TXCPSACC","TX1DX","TX2DX","TX3DX","TX4DX","TX5DX","TXCPSDX","TX1ACC","TX2ACC","TX3ACC","TX4ACC","TX5ACC","TXCPSACC",null,"TX1",95.8,25]
[null,null,null,"College",0.19,0.21,0.2,0.13,0.27,0.2,0.17,0.19,0.17,0.11,0.22,0.17,130,192,173,161,240,173,150,195,175,160,254,175,null,"TX2",101.2,34]
[null,null,null,"Primary School",0.2,0.24,0.21,0.14000000000000001,0.3,0.21,0.13,0.12,0.1,7.0000000000000007E-2,0.17,0.1,83,120,118,113,161,118,69,80,74,68,120,74,null,"TX3",99.1,37]
[null,null,null,"Secondary School",0.19,0.21,0.2,0.13,0.27,0.2,0.17,0.19,0.17,0.11,0.22,0.17,89,131,118,110,163,118,102,132,119,109,172,119,null,"TX4",92.5,49]
[null,null,null,"Convenience",0.18,0.24,0.22,0.14000000000000001,0.25,0.22,"-","-","-","-","-","-",125,214,193,188,232,193,"-","-","-","-","-","-",null,"TX5",97.4,15]
[null,null,null,"Supermarket",0.08,0.15,0.14000000000000001,0.08,0.12,0.14000000000000001,"-","-","-","-","-","-",37,78,76,74,76,76,"-","-","-","-","-","-",null,"TXCPS",99.1,37]
[null,null,null,"Full-Service Restaurant",0.21,0.23,0.21,0.13,0.25,0.21,"-","-","-","-","-","-",134,194,171,157,223,171,"-","-","-","-","-","-"]
[null,null,null,"Quick-Service Restaurant",0.18,0.24,0.22,0.14000000000000001,0.25,0.22,"-","-","-","-","-","-",109,185,167,162,201,167,"-","-","-","-","-","-"]
[null,null,null,"Hospital",0.21,0.24,0.21,0.15,0.26,0.21,0.18,0.22,0.19,0.09,0.2,0.19,160,230,202,199,273,202,151,216,187,169,247,187]
[null,null,null,"Outpatient Healthcare",0.17,0.19,0.18,0.12,0.23,0.18,"-","-","-","-","-","-",145,174,157,150,259,157,"-","-","-","-","-","-"]
[null,null,null,"Midrise Apartment",0.18,0.16,0.17,0.14000000000000001,0.28000000000000003,0.17,0.1,0.15,0.14000000000000001,0.09,0.15,0.14000000000000001,113,230,257,181,264,257,59,120,105,104,140,105]
[null,null,null,"Large Hotel",0.13,0.15,0.14000000000000001,0.08,0.19,0.14000000000000001,0.15,0.18,0.14000000000000001,0.1,0.19,0.14000000000000001,111,137,120,116,201,120,165,212,193,179,300,193]
[null,null,null,"Nursing Home",0.18,0.16,0.17,0.14000000000000001,0.28000000000000003,0.17,0.1,0.15,0.14000000000000001,0.09,0.15,0.14000000000000001,115,234,261,183,268,261,60,122,107,106,142,107]
[null,null,null,"Small Hotel/Motel",0.13,0.15,0.13,0.08,0.17,0.13,"-","-","-","-","-","-",104,133,113,109,193,113,"-","-","-","-","-","-"]
[null,null,null,"Stand-Alone Retail",0.19,0.24,0.22,0.14000000000000001,0.25,0.22,0.14000000000000001,0.19,0.19,0.12,0.18,0.19,108,158,152,148,198,152,74,120,128,120,131,128]
[null,null,null,"Strip Mall",0.21,0.23,0.21,0.13,0.26,0.21,"-","-","-","-","-","-",121,156,152,146,207,152,"-","-","-","-","-","-"]
[null,null,null,"Large Office",0.25,0.26,0.24,0.16,0.32,0.24,0.18,0.23,0.23,0.13,0.22,0.23,206,220,203,192,314,203,119,231,150,137,199,150]
[null,null,null,"Medium Office",0.19,0.2,0.19,0.11,0.25,0.19,"-","-","-","-","-","-",75,102,94,90,137,94,"-","-","-","-","-","-"]
[null,null,null,"Small Office",0.2,0.22,0.2,0.13,0.26,0.2,"-","-","-","-","-","-",111,156,138,131,215,138,"-","-","-","-","-","-"]
[null,null,null,"Public Assembly ",0.2,0.24,0.21,0.14000000000000001,0.3,0.21,0.13,0.12,0.1,7.0000000000000007E-2,0.17,0.1,112,161,159,152,217,159,93,108,99,92,162,99]
[null,null,null,"Religious Worship",0.19,0.24,0.22,0.14000000000000001,0.25,0.22,0.14000000000000001,0.19,0.19,0.12,0.18,0.19,65,95,92,89,119,92,45,72,77,72,79,77]
[null,null,null,"Service",0.21,0.23,0.21,0.13,0.25,0.21,"-","-","-","-","-","-",104,150,132,122,173,132,"-","-","-","-","-","-"]
[null,null,null,"Warehouse",0.12,0.2,0.18,0.12,0.25,0.18,"-","-","-","-","-","-",34,93,81,74,82,81,"-","-","-","-","-","-"]
[null,null,null,"Other",0.08,0.15,0.13,0.08,0.12,0.13,0.1,0.12,0.1,7.0000000000000007E-2,0.15,0.1,34,78,76,74,76,76,45,72,74,68,79,74]
[]
[null,"Guestroom, Dormitory and Multifamily Occupancy Control (NC & Retro)"]
[null,null,null,null,null,null,null,"5 Degree","5 Degree","5 Degree","5 Degree","10 Degree","10 Degree","10 Degree","10 Degree","5 Degree","5 Degree","5 Degree","5 Degree","10 Degree","10 Degree","10 Degree","10 Degree","5 Degree","5 Degree","5 Degree","5 Degree","10 Degree","10 Degree","10 Degree","10 Degree"]
[null,null,null,null,null,null,null,"Heat Pump","Heat Pump","Electric Resistance","Electric Resistance","Heat Pump","Heat Pump","Electric Resistance","Electric Resistance","Heat Pump","Heat Pump","Electric Resistance","Electric Resistance","Heat Pump","Heat Pump","Electric Resistance","Electric Resistance","Heat Pump","Heat Pump","Electric Resistance","Electric Resistance","Heat Pump","Heat Pump","Electric Resistance","Electric Resistance"]
[null,null,null,null,null,null,null,"HVAC Only","HVAC & Lights","HVAC Only","HVAC & Lights","HVAC Only","HVAC & Lights","HVAC Only","HVAC & Lights","HVAC Only","HVAC & Lights","HVAC Only","HVAC & Lights","HVAC Only","HVAC & Lights","HVAC Only","HVAC & Lights","HVAC Only","HVAC & Lights","HVAC Only","HVAC & Lights","HVAC Only","HVAC & Lights","HVAC Only","HVAC & Lights"]
[null,null,null,"State","Region","Building Type","Lookup","Peak kW","Peak kW","Peak kW","Peak kW","Peak kW","Peak kW","Peak kW","Peak kW","kWh","kWh","kWh","kWh","kWh","kWh","kWh","kWh","NCP kW","NCP kW","NCP kW","NCP kW","NCP kW","NCP kW","NCP kW","NCP kW"]
[null,null,null,null,null,null,null,{"$f":"H331&H332&H333&H334","v":"5 DegreeHeat PumpHVAC OnlyPeak kW"},"5 DegreeHeat PumpHVAC & LightsPeak kW","5 DegreeElectric ResistanceHVAC OnlyPeak kW","5 DegreeElectric ResistanceHVAC & LightsPeak kW","10 DegreeHeat PumpHVAC OnlyPeak kW","10 DegreeHeat PumpHVAC & LightsPeak kW","10 DegreeElectric ResistanceHVAC OnlyPeak kW","10 DegreeElectric ResistanceHVAC & LightsPeak kW","5 DegreeHeat PumpHVAC OnlykWh","5 DegreeHeat PumpHVAC & LightskWh","5 DegreeElectric ResistanceHVAC OnlykWh","5 DegreeElectric ResistanceHVAC & LightskWh","10 DegreeHeat PumpHVAC OnlykWh","10 DegreeHeat PumpHVAC & LightskWh","10 DegreeElectric ResistanceHVAC OnlykWh","10 DegreeElectric ResistanceHVAC & LightskWh","5 DegreeHeat PumpHVAC OnlyNCP kW","5 DegreeHeat PumpHVAC & LightsNCP kW","5 DegreeElectric ResistanceHVAC OnlyNCP kW","5 DegreeElectric ResistanceHVAC & LightsNCP kW","10 DegreeHeat PumpHVAC OnlyNCP kW","10 DegreeHeat PumpHVAC & LightsNCP kW","10 DegreeElectric ResistanceHVAC OnlyNCP kW","10 DegreeElectric ResistanceHVAC & LightsNCP kW"]
[null,null,null,"TX",1,"Motel",{"$f":"D336&E336&F336","v":"TX1Motel"},5.8999999999999997E-2,7.4999999999999997E-2,5.8999999999999997E-2,7.4999999999999997E-2,0.111,0.126,0.111,0.126,267,380,341,441,486,598,627,726,0,0,0,0,0,0,0,0]
[null,null,null,"TX",1,"Hotel",{"$f":"D337&E337&F337","v":"TX1Hotel"},5.2999999999999999E-2,7.1999999999999995E-2,5.2999999999999999E-2,7.1999999999999995E-2,0.10199999999999999,0.121,0.10199999999999999,0.121,232,439,303,530,426,568,557,684,0,0,0,0,0,0,0,0]
[null,null,null,"TX",1,"Dormitory","TX1Dormitory",3.4000000000000002E-2,6.0999999999999999E-2,3.4000000000000002E-2,6.0999999999999999E-2,7.2999999999999995E-2,8.4000000000000005E-2,7.2999999999999995E-2,8.4000000000000005E-2,136,319,152,316,261,404,289,417,0,0,0,0,0,0,0,0]
[null,null,null,"TX",2,"Motel","TX2Motel",7.5999999999999998E-2,9.0999999999999998E-2,7.5999999999999998E-2,9.0999999999999998E-2,0.14599999999999999,0.161,0.14599999999999999,0.161,315,443,365,485,559,686,640,761,0,0,0,0,0,0,0,0]
[null,null,null,"TX",2,"Hotel","TX2Hotel",7.2999999999999995E-2,9.2999999999999999E-2,7.2999999999999995E-2,9.2999999999999999E-2,0.13400000000000001,0.154,0.13400000000000001,0.154,258,452,303,505,452,617,517,676,0,0,0,0,0,0,0,0]
[null,null,null,"TX",2,"Dormitory","TX2Dormitory",4.8000000000000001E-2,7.5999999999999998E-2,4.8000000000000001E-2,7.5999999999999998E-2,7.8E-2,0.105,7.8E-2,0.105,214,425,223,428,293,505,304,511,0,0,0,0,0,0,0,0]
[null,null,null,"TX",3,"Motel","TX3Motel",8.2000000000000003E-2,9.7000000000000003E-2,8.2000000000000003E-2,9.7000000000000003E-2,0.151,0.16600000000000001,0.151,0.16600000000000001,324,461,351,484,559,695,602,735,0,0,0,0,0,0,0,0]
[null,null,null,"TX",3,"Hotel","TX3Hotel",7.3999999999999996E-2,9.4E-2,7.3999999999999996E-2,9.4E-2,0.13600000000000001,0.156,0.13600000000000001,0.156,242,430,260,450,423,599,446,621,0,0,0,0,0,0,0,0]
[null,null,null,"TX",3,"Dormitory","TX3Dormitory",5.0999999999999997E-2,7.8E-2,5.0999999999999997E-2,7.8E-2,8.1000000000000003E-2,0.108,8.1000000000000003E-2,0.108,242,461,244,462,326,543,328,545,0,0,0,0,0,0,0,0]
[null,null,null,"TX",4,"Motel","TX4Motel",8.5999999999999993E-2,0.10299999999999999,8.5999999999999993E-2,0.10299999999999999,0.16300000000000001,0.17899999999999999,0.16300000000000001,0.17899999999999999,354,500,369,513,617,761,650,792,0,0,0,0,0,0,0,0]
[null,null,null,"TX",4,"Hotel","TX4Hotel",8.1000000000000003E-2,0.10199999999999999,8.1000000000000003E-2,0.10199999999999999,0.14899999999999999,0.16900000000000001,0.14899999999999999,0.16900000000000001,260,451,267,459,467,652,483,667,0,0,0,0,0,0,0,0]
[null,null,null,"TX",4,"Dormitory","TX4Dormitory",5.2999999999999999E-2,8.1000000000000003E-2,5.2999999999999999E-2,8.1000000000000003E-2,8.7999999999999995E-2,0.114,8.7999999999999995E-2,0.114,265,492,266,492,368,591,370,593,0,0,0,0,0,0,0,0]
[null,null,null,"TX",5,"Motel","TX5Motel",6.3E-2,7.8E-2,6.3E-2,7.8E-2,0.11799999999999999,0.13300000000000001,0.11799999999999999,0.13300000000000001,251,379,283,406,432,561,482,607,0,0,0,0,0,0,0,0]
[null,null,null,"TX",5,"Hotel","TX5Hotel",5.6000000000000001E-2,7.4999999999999997E-2,5.6000000000000001E-2,7.4999999999999997E-2,0.106,0.126,0.106,0.126,178,360,196,380,312,479,338,501,0,0,0,0,0,0,0,0]
[null,null,null,"TX",5,"Dormitory","TX5Dormitory",3.1E-2,5.8999999999999997E-2,3.1E-2,5.8999999999999997E-2,4.4999999999999998E-2,0.06,4.4999999999999998E-2,0.06,110,327,110,326,151,448,153,450,0,0,0,0,0,0,0,0]
[null,null,null,"TX","CPS","Motel","TXCPSMotel",8.2000000000000003E-2,9.7000000000000003E-2,8.2000000000000003E-2,9.7000000000000003E-2,0.151,0.16600000000000001,0.151,0.16600000000000001,324,461,351,484,559,695,602,735,5.8000000000000003E-2,6.9000000000000006E-2,5.8000000000000003E-2,6.9000000000000006E-2,0.107,0.11799999999999999,0.107,0.11799999999999999]
[null,null,null,"TX","CPS","Hotel","TXCPSHotel",7.3999999999999996E-2,9.4E-2,7.3999999999999996E-2,9.4E-2,0.13600000000000001,0.156,0.13600000000000001,0.156,242,430,260,450,423,599,446,621,5.2999999999999999E-2,6.7000000000000004E-2,5.2999999999999999E-2,6.7000000000000004E-2,9.7000000000000003E-2,0.111,9.7000000000000003E-2,0.111]
[null,null,null,"TX","CPS","Dormitory","TXCPSDormitory",5.0999999999999997E-2,7.8E-2,5.0999999999999997E-2,7.8E-2,8.1000000000000003E-2,0.108,8.1000000000000003E-2,0.108,242,461,244,462,326,543,328,545,3.5999999999999997E-2,5.5E-2,3.5999999999999997E-2,5.5E-2,5.8000000000000003E-2,7.6999999999999999E-2,5.8000000000000003E-2,7.6999999999999999E-2]
[]
[null,null,null,"Motel","HVAC Only","Heat Pump","5 Degree"]
[null,null,null,"Hotel","HVAC & Lights","Electric Resistance","10 Degree"]
[null,null,null,"Dormitory"]
[]
[null,"Smart Thermostats"]
[]
[null,null,null,"Principal Building Activity","DXTX1c","DXTX1h","AirCooledChillerTX1c","WaterCooledChillerTX1c","DXTX2c","DXTX2h","AirCooledChillerTX2c","WaterCooledChillerTX2c","DXTX3c","DXTX3h","AirCooledChillerTX3c","WaterCooledChillerTX3c","DXTX4c","DXTX4h","AirCooledChillerTX4c","WaterCooledChillerTX4c","DXTX5c","DXTX5h","AirCooledChillerTX5c","WaterCooledChillerTX5c"]
[null,null,null,"College",787,"--",1115,1243,1595,153,1587,1761,1843,69,1858,2099,2211,39,2340,2583,1092,146,1278,1458]
[null,null,null,"Primary School",740,701,576,971,1208,397,726,1412,1443,239,818,1627,1680,156,937,1845,996,408,751,1113]
[null,"DX - Air Conditioner",null,"Secondary School",535,736,802,1772,1084,489,1170,2234,1253,293,1306,2404,1503,196,1503,2577,742,431,1039,2196]
[null,"DX - Heat Pump",null,"Convenience",884,340,294,433,1835,153,563,799,2142,69,737,1031,2510,39,839,1176,1251,null,435,571]
[null,"Air Cooled Chiller",null,"Supermarket",219,340,294,433,615,153,563,799,744,69,737,1031,894,39,839,1176,347,146,435,571]
[null,"Water Cooled Chiller",null,"Full-Service Restaurant",1020,1123,294,433,1823,688,563,799,2135,429,737,1031,2530,292,839,1176,1276,613,435,571]
[null,null,null,"24Hr Full-Service",1093,1346,294,433,2061,873,563,799,2426,559,737,1031,2897,377,839,1176,1413,809,435,571]
[null,null,null,"Quick-Service Restaurant",765,1029,294,433,1588,631,563,799,1853,372,737,1031,2172,232,839,1176,1082,522,435,571]
[null,null,null,"24Hr Quick Service",817,1300,294,433,1765,794,563,799,2059,483,737,1031,2440,296,839,1176,1171,697,435,571]
[null,null,null,"Hospital",2185,340,2006,2711,3097,153,2784,3683,3490,69,3116,4171,3819,39,3455,4637,2555,146,2355,2992]
[null,null,null,"Outpatient Healthcare",2036,579,294,433,2532,310,563,799,2844,196,737,1031,3092,122,839,1176,2377,320,435,571]
[null,null,null,"Midrise Apartment",674,340,421,1098,1709,153,1060,2053,2031,69,1295,2467,2236,39,1534,2840,1209,146,841,1553]
[null,null,null,"Large Hotel",1345,1095,1283,1553,2079,464,2086,2627,2531,250,2499,3201,2981,131,2908,3713,1701,440,1815,2038]
[null,null,null,"Nursing Home",685,340,428,1115,1736,153,1077,2085,2063,69,1315,2506,2271,39,1558,2884,1228,146,854,1577]
[null,null,null,"Small Hotel/Motel",1554,475,294,433,2281,249,563,799,2316,147,737,1031,2530,82,839,1176,1921,185,435,571]
[null,null,null,"Stand-Alone Retail",623,907,489,719,1157,352,936,1328,1399,204,1224,1712,1582,131,1394,1953,904,384,722,948]
[null,null,null,"24Hr Stand-Alone Retail",820,1277,681,974,1539,632,1307,1975,1804,374,1513,2427,2118,255,1725,2768,1228,808,884,1371]
[null,null,null,"Strip Mall",687,753,294,433,1100,376,563,799,1330,218,737,1031,1510,141,839,1176,931,448,435,571]
[null,null,null,"Large Office",2058,340,1208,1506,2379,153,1711,2062,2619,69,1820,2312,2778,39,2027,2570,2423,146,1442,1683]
[null,null,null,"Medium Office",925,576,294,433,1236,262,563,799,1387,149,737,1031,1523,83,839,1176,1173,256,435,571]
[null,null,null,"Small Office",711,340,294,433,1203,153,563,799,1338,69,737,1031,1504,39,839,1176,1037,146,435,571]
[null,null,null,"Public Assembly ",995,340,774,1306,1624,153,976,1898,1940,69,1100,2188,2259,39,1260,2481,1339,146,1010,1496]
[null,null,null,"Religious Worship",387,340,294,433,567,153,563,799,576,69,737,1031,629,39,839,1176,478,146,435,571]
[null,null,null,"Service",790,340,294,433,1412,153,563,799,1653,69,737,1031,1959,39,839,1176,988,146,435,571]
[null,null,null,"Warehouse",173,340,294,433,597,153,563,799,633,69,737,1031,665,39,839,1176,324,146,435,571]
[null,null,null,"Other",173,340,294,433,567,153,563,799,576,69,737,1031,629,39,839,1176,324,146,435,571]
[]
[null,"HVLS Fans"]
[null,null,null,"Climate Zone","Hours"]
[null,null,null,"TX1",2215]
[null,"Used TX3 for CPS",null,"TX2",3969]
[null,"Disregarded ER case for simplicity",null,"TX3",4750]
[null,null,null,"TX4",5375]
[null,null,null,"TX5",3034]
[null,null,null,"TXCPS",4750]
[]
[null,"EnergyStar Pool Pumps"]
[null,null,null,null,"kWh savings",null,null,"Demand Savings (kW)"]
[null,null,null,"Rated Pump hp (new)","Year-Round 24/7 Operation","Year-Round Limited-Hours Operation","Seasonal Operation (7 months)"]
[null,null,null,"≤ 1.25",8117,4058,2366,0.92700000000000005]
[null,null,null," 1.25 < hp ≤ 1.75",8993,4497,2622,1.0269999999999999]
[null,null,null,"1.75 < hp ≤ 2.25",8866,4433,2585,1.012]
[null,null,null,"2.25 < hp ≤ 2.75",10723,5362,3126,1.224]
[null,null,null,"2.75 < hp ≤ 3",11320,5660,3300,1.292]
[]
[null,"Premium Efficiency Motors"]
[null,null,null,"Application","Load Factor",null,null,null,null,null,"Hours"]
[null,null,null,"Motor Range (Min of Size) ->",1,6,21,51,101,201,1,6,21,51,101,201]
[null,null,null,"HVAC - Hospital",0.75,0.75,0.75,0.75,0.75,0.75,8760,8760,8760,8760,8760,8760]
[null,null,null,"HVAC - Large Office (>30K SqFt)",0.75,0.75,0.75,0.75,0.75,0.75,4424,4424,4424,4424,4424,4424]
[null,null,null,"HVAC - Small Office (<30k Sq Ft)",0.75,0.75,0.75,0.75,0.75,0.75,4006,4006,4006,4006,4006,4006]
[null,null,null,"HVAC - K-12 School",0.75,0.75,0.75,0.75,0.75,0.75,4173,4173,4173,4173,4173,4173]
[null,null,null,"HVAC - College",0.75,0.75,0.75,0.75,0.75,0.75,4590,4590,4590,4590,4590,4590]
[null,null,null,"HVAC - Retail",0.75,0.75,0.75,0.75,0.75,0.75,5548,5548,5548,5548,5548,5548]
[null,null,null,"HVAC - Restaurant (Fast Food)",0.75,0.75,0.75,0.75,0.75,0.75,6716,6716,6716,6716,6716,6716]
[null,null,null,"HVAC - Restaurant (Sit Down)",0.75,0.75,0.75,0.75,0.75,0.75,5256,5256,5256,5256,5256,5256]
[null,null,null,"Industrial - Chem",0.54,0.51,0.6,0.54,0.75,0.57999999999999996,4082,4910,4873,5853,5868,5474]
[null,null,null,"Industrial - Paper",0.54,0.51,0.6,0.54,0.75,0.57999999999999996,3997,4634,5481,6741,6669,6975]
[null,null,null,"Industrial - Metals",0.54,0.51,0.6,0.54,0.75,0.57999999999999996,4377,4140,4854,6698,7362,7114]
[null,null,null,"Industrial - Petroleum Refinery",0.54,0.51,0.6,0.54,0.75,0.57999999999999996,1582,1944,3025,3763,4170,5311]
[null,null,null,"Industrial - Food Production",0.54,0.51,0.6,0.54,0.75,0.57999999999999996,3829,3949,4927,5524,5055,3711]
[null,null,null,"Industrial - Other",0.54,0.51,0.6,0.54,0.75,0.57999999999999996,2283,3043,3530,4732,4174,5396]
[]
[]
[null,null,null,"FULL-LOAD EFFICIENCIES OF ENERGY EFFICIENT MOTORS",null,null,null,null,null,null,"Early Retirement Baseline Efficiencies"]
[null,null,null,"HP","Open Motors (ODP) - 6 Pole","Open Motors (ODP) - 4 Pole","Open Motors (ODP) - 2 Pole","Closed Motors (TEFC) - 6 Pole","Closed Motors (TEFC) - 4 Pole","Closed Motors (TEFC) - 2 Pole","Open Motors (ODP) - 6 Pole","Open Motors (ODP) - 4 Pole","Open Motors (ODP) - 2 Pole","Closed Motors (TEFC) - 6 Pole","Closed Motors (TEFC) - 4 Pole","Closed Motors (TEFC) - 2 Pole"]
[null,null,null,1,0.82499999999999996,0.85499999999999998,0.77,0.82499999999999996,0.85499999999999998,0.77,0.8,0.82499999999999996,0.755,0.8,0.82499999999999996,0.755]
[null,null,null,1.5,0.86499999999999999,0.86499999999999999,0.84,0.875,0.86499999999999999,0.84,0.84,0.84,0.82499999999999996,0.85499999999999998,0.84,0.82499999999999996]
[null,null,null,2,0.875,0.86499999999999999,0.85499999999999998,0.88500000000000001,0.86499999999999999,0.85499999999999998,0.85499999999999998,0.84,0.84,0.86499999999999999,0.84,0.84]
[null,null,null,3,0.88500000000000001,0.89500000000000002,0.85499999999999998,0.89500000000000002,0.89500000000000002,0.86499999999999999,0.86499999999999999,0.86499999999999999,0.84,0.875,0.875,0.85499999999999998]
[null,null,null,5,0.89500000000000002,0.89500000000000002,0.86499999999999999,0.89500000000000002,0.89500000000000002,0.88500000000000001,0.875,0.875,0.85499999999999998,0.875,0.875,0.875]
[null,null,null,7.5,0.90200000000000002,0.91,0.88500000000000001,0.91,0.91700000000000004,0.89500000000000002,0.88500000000000001,0.88500000000000001,0.875,0.89500000000000002,0.89500000000000002,0.88500000000000001]
[null,null,null,10,0.91700000000000004,0.91700000000000004,0.89500000000000002,0.91,0.91700000000000004,0.90200000000000002,0.90200000000000002,0.89500000000000002,0.88500000000000001,0.89500000000000002,0.89500000000000002,0.89500000000000002]
[null,null,null,15,0.91700000000000004,0.93,0.90200000000000002,0.91700000000000004,0.92400000000000004,0.91,0.90200000000000002,0.91,0.89500000000000002,0.90200000000000002,0.91,0.90200000000000002]
[null,null,null,20,0.92400000000000004,0.93,0.91,0.91700000000000004,0.93,0.91,0.91,0.91,0.90200000000000002,0.90200000000000002,0.91,0.90200000000000002]
[null,null,null,25,0.93,0.93599999999999994,0.91700000000000004,0.93,0.93599999999999994,0.91700000000000004,0.91700000000000004,0.91700000000000004,0.91,0.91700000000000004,0.92400000000000004,0.91]
[null,null,null,30,0.93599999999999994,0.94099999999999995,0.91700000000000004,0.93,0.93599999999999994,0.91700000000000004,0.92400000000000004,0.92400000000000004,0.91,0.91700000000000004,0.92400000000000004,0.91]
[null,null,null,40,0.94099999999999995,0.94099999999999995,0.92400000000000004,0.94099999999999995,0.94099999999999995,0.92400000000000004,0.93,0.93,0.91700000000000004,0.93,0.93,0.91700000000000004]
[null,null,null,50,0.94099999999999995,0.94499999999999995,0.93,0.94099999999999995,0.94499999999999995,0.93,0.93,0.93,0.92400000000000004,0.93,0.93,0.92400000000000004]
[null,null,null,60,0.94499999999999995,0.95,0.93599999999999994,0.94499999999999995,0.95,0.93599999999999994,0.93599999999999994,0.93599999999999994,0.93,0.93599999999999994,0.93599999999999994,0.93]
[null,null,null,75,0.94499999999999995,0.95,0.93599999999999994,0.94499999999999995,0.95400000000000007,0.93599999999999994,0.93599999999999994,0.94099999999999995,0.93,0.93599999999999994,0.94099999999999995,0.93]
[null,null,null,100,0.95,0.95400000000000007,0.93599999999999994,0.95,0.95400000000000007,0.94099999999999995,0.94099999999999995,0.94099999999999995,0.93,0.94099999999999995,0.94499999999999995,0.93599999999999994]
[null,null,null,125,0.95,0.95400000000000007,0.94099999999999995,0.95,0.95400000000000007,0.95,0.94099999999999995,0.94499999999999995,0.93599999999999994,0.94099999999999995,0.94499999999999995,0.94499999999999995]
[null,null,null,150,0.95400000000000007,0.95799999999999996,0.94099999999999995,0.95799999999999996,0.95799999999999996,0.95,0.94499999999999995,0.95,0.93599999999999994,0.95,0.95,0.94499999999999995]
[null,null,null,200,0.95400000000000007,0.95799999999999996,0.95,0.95799999999999996,0.96200000000000008,0.95400000000000007,0.94499999999999995,0.95,0.94499999999999995,0.95,0.95,0.95]
[null,null,null,250,0.95400000000000007,0.95400000000000007,0.94499999999999995,0.95,0.95,0.95400000000000007,0.95400000000000007,0.95400000000000007,0.94499999999999995,0.95,0.95,0.95400000000000007]
[null,null,null,300,0.95400000000000007,0.95400000000000007,0.95,0.95,0.95400000000000007,0.95400000000000007,0.95400000000000007,0.95400000000000007,0.95,0.95,0.95400000000000007,0.95400000000000007]
[null,null,null,350,0.95400000000000007,0.95400000000000007,0.95,0.95,0.95400000000000007,0.95400000000000007,0.95400000000000007,0.95400000000000007,0.95,0.95,0.95400000000000007,0.95400000000000007]
[null,null,null,400,"n/a",0.95400000000000007,0.95400000000000007,"n/a",0.95400000000000007,0.95400000000000007,"n/a",0.95400000000000007,0.95400000000000007,"n/a",0.95400000000000007,0.95400000000000007]
[null,null,null,450,"n/a",0.95799999999999996,0.95799999999999996,"n/a",0.95400000000000007,0.95400000000000007,"n/a",0.95799999999999996,0.95799999999999996,"n/a",0.95400000000000007,0.95400000000000007]
[null,null,null,500,"n/a",0.95799999999999996,0.95799999999999996,"n/a",0.95799999999999996,0.95400000000000007,"n/a",0.95799999999999996,0.95799999999999996,"n/a",0.95799999999999996,0.95400000000000007]
[]
[]
[]
[null,null,null,"Age of Replaced Motor (Years","RUL (Years)"]
[null,null,null,1,13.9]
[null,null,null,2,12.9]
[null,null,null,3,11.9]
[null,null,null,4,10.9]
[null,null,null,5,9.9]
[null,null,null,6,8.9]
[null,null,null,7,7.9]
[null,null,null,8,6.9]
[null,null,null,9,5.9]
[null,null,null,10,5]
[null,null,null,11,4.2]
[null,null,null,12,3.6]
[null,null,null,13,3]
[null,null,null,14,2.5]
[null,null,null,15,2]
[null,null,null,16,1]
[null,null,null,"17 or more",0]
[]
[null,"Pump-Off Controller"]
[null,null,null,"Stipulated Values"]
[null,null,null,"HP-kW Conversion Factor",0.746]
[null,null,null,"Motor Load Factor",0.25]
[null,null,null,"Mechanical Efficiency of Sucker Rod Pump",0.95]
[null,null,null,"Clock Timer %",0.65]
[null,null,null,"Annual Hours",8760]
[null,null,null,"Run Constant",8.3360000000000003]
[null,null,null,"Run Coefficient",0.95599999999999996]
[]
[null,"Window Film Treatment",null,null,null,"kWh/sq ft",null,null,"kW/sq ft"]
[null,null,null,"Orientation","Solar Heat Gain (SHG) [Btu/ft2-year]","Peak Hour Solar Heat Gain (SHGF) [Btu/hr-ft2-year]",null,null,null,null,null,"NCP Hour Solar Heat Gain",null,null,"SHADING TYPE",null,null,"HVAC TYPE"]
[null,null,null,null,null,"TX1","TX2","TX3","TX4","TX5","TXCPS","TXCPS",null,null,"Shading Type","Shading Coefficient",null,"HVAC Type","COP"]
[null,null,null,"South-East",158844,25,25,25,25,34,29,36,null,null,"None",0.95,null,"Air Conditioners & Heat Pumps",3.02]
[null,null,null,"South-South-East",134794,26,26,26,26,38,30,38,null,null,"Roller Shade",0.81,null,"Air-Cooled Chillers",3.1]
[null,null,null,"South",120839,33,33,44,44,57,34,57,null,null,"Venetian Blinds",0.74,null,"Water-Cooled Chillers",5]
[null,null,null,"South-South-West",134794,87,87,106,111,102,76,127,null,null,"Louvered Exterior Shades",0.59,null,"Room Air Conditioner",2.84]
[null,null,null,"South-West",158844,152,152,164,173,143,139,181,null,null,"Draperies - Open Weave",0.65,null,"PTAC/PTHP",3.66]
[null,null,null,"West-South-West",169696,192,192,196,207,163,181,210,null,null,"Draperies - Close Weave",0.53]
[null,null,null,"West",163006,204,204,198,211,15,195,219]
[null,null,null,"West-North-West",139615,185,185,170,183,131,181,208]
[null,null,null,"North-West",107161,139,139,117,126,89,140,176]
[]
[null,"EnergyStar Roofing"]
[null,null,null,null,"Baseline R-Values (down) / Post R-Values (across)","R ≤ 13","13 < R ≤ 20","20 < R","R ≤ 13","13 < R ≤ 20","20 < R"]
[null,null,null,"TX1Retail","R ≤ 13",0.72,1.26,1.25,1.9280000000000002E-4,3.6230000000000002E-4,3.858E-4]
[null,null,null,null,"13 < R ≤ 20",null,0.13,0.12,"",4.8099999999999997E-5,6.4700000000000001E-5]
[null,null,null,null,"20 < R",null,null,0.09,"","",3.3200000000000001E-5]
[null,null,null,"TX1EducationChiller","R ≤ 13",0.65,1.1000000000000001,1.25,1.1800000000000002E-4,2.1760000000000003E-4,2.5530000000000003E-4]
[null,null,null,null,"13 < R ≤ 20",null,0.26,0.38,"",4.85E-5,7.7999999999999999E-5]
[null,"Dropdowns:",null,null,"20 < R",null,null,0.17,"","",3.4E-5]
[null,null,null,"TX1EducationDX","R ≤ 13",0.26,0.43,0.49,8.2600000000000002E-5,1.5470000000000002E-4,1.8200000000000001E-4]
[null,"Retail",null,null,"13 < R ≤ 20",null,0.12,0.18,"",4.110000000000001E-5,6.6700000000000009E-5]
[null,"Education (Chiller)",null,null,"20 < R",null,null,0.08,"","",2.9100000000000003E-5]
[null,"Education (DX)",null,"TX1OfficeChiller","R ≤ 13",0.21,0.31,0.33,6.7999999999999999E-5,3.4400000000000003E-5,1.9300000000000003E-4]
[null,"Office (Chiller)",null,null,"13 < R ≤ 20",null,0.09,0.11,"",1.6579999999999999E-4,5.9400000000000007E-5]
[null,"Office (DX)",null,null,"20 < R",null,null,0.06,"","",2.3600000000000001E-5]
[null,"Hotel",null,"TX1OfficeDX","R ≤ 13",0.28000000000000003,0.87,1.1000000000000001,7.4600000000000011E-5,1.5480000000000002E-4,1.861E-4]
[null,"Warehouse",null,null,"13 < R ≤ 20",null,0.15,0.38,"",4.1200000000000005E-5,6.730000000000001E-5]
[null,"Other",null,null,"20 < R",null,null,0.11,"","",2.9200000000000002E-5]
[null,null,null,"TX1Hotel","R ≤ 13",7.0000000000000007E-2,7.0000000000000007E-2,7.0000000000000007E-2,1.3300000000000001E-5,1.8300000000000001E-5,2.0299999999999999E-5]
[null,"R ≤ 13 (or) Before 2011",null,null,"13 < R ≤ 20",null,0.04,0.04,"",8.1000000000000004E-6,1.0000000000000001E-5]
[null,"13 < R ≤ 20 (or) Between 2011 - 2016","RRange1",null,"20 < R",null,null,0.03,"","",6.0000000000000002E-6]
[null,"20 < R (or) After 2016","RRange2","TX1Warehouse","R ≤ 13",0.04,0.11,0.14000000000000001,3.8300000000000003E-5,6.9900000000000005E-5,8.070000000000001E-5]
[null,null,"RRange3",null,"13 < R ≤ 20",null,0.01,0.04,"",1.3500000000000001E-5,2.2400000000000002E-5]
[null,"R ≤ 13",null,null,"20 < R",null,null,0.01,"","",9.0000000000000002E-6]
[null,"13 < R ≤ 20",null,"TX1Other","R ≤ 13",0.04,7.0000000000000007E-2,7.0000000000000007E-2,1.3300000000000001E-5,1.8300000000000001E-5,2.0299999999999999E-5]
[null,"20 < R",null,null,"13 < R ≤ 20",null,0.01,0.04,"",8.1000000000000004E-6,1.0000000000000001E-5]
[null,null,null,null,"20 < R",null,null,0.01,"","",6.0000000000000002E-6]
[null,null,null,"TX2Retail","R ≤ 13",0.61,0.97,0.98,2.2030000000000004E-4,3.7670000000000005E-4,4.0540000000000004E-4]
[null,null,null,null,"13 < R ≤ 20",null,0.16,0.17,"",7.570000000000001E-5,9.6700000000000006E-5]
[null,null,null,null,"20 < R",null,null,0.13,"","",6.2200000000000008E-5]
[null,null,null,"TX2EducationChiller","R ≤ 13",0.56000000000000005,0.82,0.92,1.0490000000000002E-4,1.6500000000000003E-4,1.886E-4]
[null,null,null,null,"13 < R ≤ 20",null,0.28999999999999998,0.36,"",5.4100000000000007E-5,7.2800000000000008E-5]
[null,null,null,null,"20 < R",null,null,0.24,"","",4.3700000000000005E-5]
[null,null,null,"TX2EducationDX","R ≤ 13",0.27,0.39,0.43,1.0650000000000001E-4,1.8310000000000001E-4,2.1330000000000001E-4]
[null,null,null,null,"13 < R ≤ 20",null,0.17,0.21,"",7.2100000000000004E-5,1.0080000000000001E-4]
[null,null,null,null,"20 < R",null,null,0.13,"","",5.8800000000000006E-5]
[null,null,null,"TX2OfficeChiller","R ≤ 13",0.23,0.33,0.34,1.1990000000000001E-4,2.7480000000000001E-4,3.0550000000000005E-4]
[null,null,null,null,"13 < R ≤ 20",null,0.13,0.15,"",6.6799999999999997E-5,9.7600000000000001E-5]
[null,null,null,null,"20 < R",null,null,0.1,"","",6.0100000000000004E-5]
[null,null,null,"TX2OfficeDX","R ≤ 13",0.27,0.52,0.62,1.2140000000000001E-4,2.4530000000000005E-4,2.945E-4]
[null,null,null,null,"13 < R ≤ 20",null,0.18,0.28000000000000003,"",7.25E-5,1.1090000000000001E-4]
[null,null,null,null,"20 < R",null,null,0.15,"","",6.0300000000000009E-5]
[null,null,null,"TX2Hotel","R ≤ 13",7.0000000000000007E-2,7.0000000000000007E-2,7.0000000000000007E-2,1.7100000000000002E-5,2.3E-5,2.5600000000000002E-5]
[null,null,null,null,"13 < R ≤ 20",null,0.05,0.05,"",1.17E-5,1.4200000000000001E-5]
[null,null,null,null,"20 < R",null,null,0.05,"","",1.0100000000000002E-5]
[null,null,null,"TX2Warehouse","R ≤ 13",0.05,0.09,0.16,4.0099999999999999E-5,6.5400000000000004E-5,1.1160000000000002E-4]
[null,null,null,null,"13 < R ≤ 20",null,0.02,0.08,"",1.1800000000000001E-5,4.9400000000000008E-5]
[null,null,null,null,"20 < R",null,null,0.01,"","",1.0200000000000001E-5]
[null,null,null,"TX2Other","R ≤ 13",0.05,7.0000000000000007E-2,7.0000000000000007E-2,1.7100000000000002E-5,2.3E-5,2.5600000000000002E-5]
[null,null,null,null,"13 < R ≤ 20",null,0.02,0.05,"",1.17E-5,1.4200000000000001E-5]
[null,null,null,null,"20 < R",null,null,0.01,"","",1.0100000000000002E-5]
[null,null,null,"TX3Retail","R ≤ 13",0.62,1,1.01,1.7210000000000001E-4,2.9600000000000004E-4,3.1610000000000004E-4]
[null,null,null,null,"13 < R ≤ 20",null,0.41,0.41,"",1.043E-4,1.1890000000000002E-4]
[null,null,null,null,"20 < R",null,null,0.14000000000000001,"","",4.6600000000000008E-5]
[null,null,null,"TX3EducationChiller","R ≤ 13",0.62,0.87,0.95,9.5600000000000006E-5,1.528E-4,1.7530000000000003E-4]
[null,null,null,null,"13 < R ≤ 20",null,0.33,0.39,"",5.0400000000000005E-5,6.8100000000000002E-5]
[null,null,null,null,"20 < R",null,null,0.26,"","",4.0500000000000002E-5]
[null,null,null,"TX3EducationDX","R ≤ 13",0.28999999999999998,0.4,0.44,9.3900000000000019E-5,1.5760000000000001E-4,1.8260000000000002E-4]
[null,null,null,null,"13 < R ≤ 20",null,0.18,0.22,"",6.2100000000000005E-5,8.5800000000000012E-5]
[null,null,null,null,"20 < R",null,null,0.14000000000000001,"","",5.0800000000000002E-5]
[null,null,null,"TX3OfficeChiller","R ≤ 13",0.25,0.33,0.34,9.4500000000000007E-5,2.1390000000000002E-4,2.354E-4]
[null,null,null,null,"13 < R ≤ 20",null,0.17,0.18,"",1.0750000000000001E-4,1.284E-4]
[null,null,null,null,"20 < R",null,null,0.12,"","",4.5400000000000006E-5]
[null,null,null,"TX3OfficeDX","R ≤ 13",0.28000000000000003,0.46,0.54,8.3000000000000012E-5,1.8660000000000001E-4,2.2360000000000001E-4]
[null,null,null,null,"13 < R ≤ 20",null,0.19,0.26,"",5.4200000000000003E-5,8.3900000000000006E-5]
[null,null,null,null,"20 < R",null,null,0.15,"","",4.35E-5]
[null,null,null,"TX3Hotel","R ≤ 13",0.08,7.0000000000000007E-2,7.0000000000000007E-2,1.6900000000000001E-5,2.26E-5,2.5000000000000001E-5]
[null,null,null,null,"13 < R ≤ 20",null,0.06,0.05,"",1.2100000000000001E-5,1.43E-5]
[null,null,null,null,"20 < R",null,null,0.05,"","",1.0300000000000001E-5]
[null,null,null,"TX3Warehouse","R ≤ 13",0.05,0.09,0.16,2.9600000000000001E-5,5.13E-5,9.2100000000000016E-5]
[null,null,null,null,"13 < R ≤ 20",null,0.02,0.08,"",1.3200000000000002E-5,4.6600000000000008E-5]
[null,null,null,null,"20 < R",null,null,0.01,"","",7.9000000000000006E-6]
[null,null,null,"TX3Other","R ≤ 13",0.05,7.0000000000000007E-2,7.0000000000000007E-2,1.6900000000000001E-5,2.26E-5,2.5000000000000001E-5]
[null,null,null,null,"13 < R ≤ 20",null,0.02,0.05,"",1.2100000000000001E-5,1.43E-5]
[null,null,null,null,"20 < R",null,null,0.01,"","",7.9000000000000006E-6]
[null,null,null,"TX4Retail","R ≤ 13",0.62,0.99,1,1.3050000000000003E-4,2.1990000000000001E-4,2.3210000000000003E-4]
[null,null,null,null,"13 < R ≤ 20",null,0.41,0.41,"",8.0800000000000012E-5,8.9499999999999994E-5]
[null,null,null,null,"20 < R",null,null,0.13,"","",3.4200000000000005E-5]
[null,null,null,"TX4EducationChiller","R ≤ 13",0.6,0.83,0.9,8.460000000000001E-5,1.3550000000000001E-4,1.5490000000000002E-4]
[null,null,null,null,"13 < R ≤ 20",null,0.31,0.36,"",4.4800000000000005E-5,6.0000000000000008E-5]
[null,null,null,null,"20 < R",null,null,0.24,"","",3.6400000000000004E-5]
[null,null,null,"TX4EducationDX","R ≤ 13",0.28000000000000003,0.38,0.41,7.3400000000000009E-5,1.178E-4,1.3530000000000001E-4]
[null,null,null,null,"13 < R ≤ 20",null,0.17,0.2,"",4.6400000000000003E-5,6.2900000000000011E-5]
[null,null,null,null,"20 < R",null,null,0.14000000000000001,"","",3.7700000000000002E-5]
[null,null,null,"TX4OfficeChiller","R ≤ 13",0.22,0.31,0.32,6.4400000000000007E-5,1.3550000000000001E-4,1.5300000000000003E-4]
[null,null,null,null,"13 < R ≤ 20",null,0.17,0.18,"",6.340000000000001E-5,7.960000000000001E-5]
[null,null,null,null,"20 < R",null,null,0.1,"","",3.2700000000000002E-5]
[null,null,null,"TX4OfficeDX","R ≤ 13",0.26,0.4,0.45,5.02E-5,8.6600000000000004E-5,1.0090000000000001E-4]
[null,null,null,null,"13 < R ≤ 20",null,0.18,0.24,"",3.6100000000000003E-5,4.8300000000000002E-5]
[null,null,null,null,"20 < R",null,null,0.15,"","",2.9500000000000006E-5]
[null,null,null,"TX4Hotel","R ≤ 13",7.0000000000000007E-2,7.0000000000000007E-2,7.0000000000000007E-2,1.13E-5,1.4400000000000001E-5,1.5700000000000002E-5]
[null,null,null,null,"13 < R ≤ 20",null,0.05,0.05,"",7.8000000000000016E-6,9.0000000000000002E-6]
[null,null,null,null,"20 < R",null,null,0.04,"","",6.7000000000000011E-6]
[null,null,null,"TX4Warehouse","R ≤ 13",0.05,0.09,0.16,2.1000000000000002E-5,3.5099999999999999E-5,6.5400000000000004E-5]
[null,null,null,null,"13 < R ≤ 20",null,0.02,0.08,"",1.2100000000000001E-5,3.7100000000000001E-5]
[null,null,null,null,"20 < R",null,null,0.01,"","",6.9999999999999999E-6]
[null,null,null,"TX4Other","R ≤ 13",0.05,7.0000000000000007E-2,7.0000000000000007E-2,1.13E-5,1.4400000000000001E-5,1.5700000000000002E-5]
[null,null,null,null,"13 < R ≤ 20",null,0.02,0.05,"",7.8000000000000016E-6,9.0000000000000002E-6]
[null,null,null,null,"20 < R",null,null,0.01,"","",6.7000000000000011E-6]
[null,null,null,"TX5Retail","R ≤ 13",0.67,1.01,1.02,1.6550000000000001E-4,2.6850000000000002E-4,2.8780000000000006E-4]
[null,null,null,null,"13 < R ≤ 20",null,0.19,0.19,"",5.8300000000000008E-5,7.2400000000000012E-5]
[null,null,null,null,"20 < R",null,null,0.15,"","",4.7400000000000007E-5]
[null,null,null,"TX5EducationChiller","R ≤ 13",0.69,0.97,1.07,9.09E-5,1.4420000000000001E-4,1.652E-4]
[null,null,null,null,"13 < R ≤ 20",null,0.36,0.44,"",4.8000000000000001E-5,6.4700000000000001E-5]
[null,null,null,null,"20 < R",null,null,0.28000000000000003,"","",3.9100000000000002E-5]
[null,null,null,"TX5EducationDX","R ≤ 13",0.3,0.42,0.46,8.2100000000000017E-5,1.3430000000000001E-4,1.5490000000000002E-4]
[null,null,null,null,"13 < R ≤ 20",null,0.18,0.22,"",5.1600000000000007E-5,7.0900000000000002E-5]
[null,null,null,null,"20 < R",null,null,0.14000000000000001,"","",4.1400000000000003E-5]
[null,null,null,"TX5OfficeChiller","R ≤ 13",0.28999999999999998,0.39,0.42,9.7200000000000018E-5,1.7570000000000002E-4,2.0350000000000004E-4]
[null,null,null,null,"13 < R ≤ 20",null,0.17,0.2,"",6.6799999999999997E-5,9.2200000000000018E-5]
[null,null,null,null,"20 < R",null,null,0.14000000000000001,"","",5.3900000000000002E-5]
[null,null,null,"TX5OfficeDX","R ≤ 13",0.31,0.55000000000000004,0.64,9.9300000000000001E-5,1.6570000000000002E-4,1.9260000000000002E-4]
[null,null,null,null,"13 < R ≤ 20",null,0.2,0.28999999999999998,"",5.7500000000000002E-5,7.7800000000000007E-5]
[null,null,null,null,"20 < R",null,null,0.16,"","",4.7000000000000004E-5]
[null,null,null,"TX5Hotel","R ≤ 13",0.1,0.08,0.08,1.3300000000000001E-5,1.5800000000000001E-5,1.6800000000000002E-5]
[null,null,null,null,"13 < R ≤ 20",null,7.0000000000000007E-2,0.06,"",9.5000000000000005E-6,1.04E-5]
[null,null,null,null,"20 < R",null,null,0.06,"","",8.1000000000000004E-6]
[null,null,null,"TX5Warehouse","R ≤ 13",0.04,0.09,0.15,2.76E-5,4.9100000000000008E-5,8.2700000000000004E-5]
[null,null,null,null,"13 < R ≤ 20",null,0.02,7.0000000000000007E-2,"",1.3100000000000002E-5,3.9800000000000005E-5]
[null,null,null,null,"20 < R",null,null,0.01,"","",7.6000000000000009E-6]
[null,null,null,"TX5Other","R ≤ 13",0.04,0.08,0.08,1.3300000000000001E-5,1.5800000000000001E-5,1.6800000000000002E-5]
[null,null,null,null,"13 < R ≤ 20",null,0.02,0.06,"",9.5000000000000005E-6,1.04E-5]
[null,null,null,null,"20 < R",null,null,0.01,"","",7.6000000000000009E-6]
[null,null,null,"TXCPSRetail","R ≤ 13",0.62,1,1.01,1.7210000000000001E-4,2.9600000000000004E-4,3.1610000000000004E-4]
[null,null,null,null,"13 < R ≤ 20",null,0.41,0.41,"",1.043E-4,1.1890000000000002E-4]
[null,null,null,null,"20 < R",null,null,0.14000000000000001,"","",4.6600000000000008E-5]
[null,null,null,"TXCPSEducationChiller","R ≤ 13",0.62,0.87,0.95,9.5600000000000006E-5,1.528E-4,1.7530000000000003E-4]
[null,null,null,null,"13 < R ≤ 20",null,0.33,0.39,"",5.0400000000000005E-5,6.8100000000000002E-5]
[null,null,null,null,"20 < R",null,null,0.26,"","",4.0500000000000002E-5]
[null,null,null,"TXCPSEducationDX","R ≤ 13",0.28999999999999998,0.4,0.44,9.3900000000000019E-5,1.5760000000000001E-4,1.8260000000000002E-4]
[null,null,null,null,"13 < R ≤ 20",null,0.18,0.22,"",6.2100000000000005E-5,8.5800000000000012E-5]
[null,null,null,null,"20 < R",null,null,0.14000000000000001,"","",5.0800000000000002E-5]
[null,null,null,"TXCPSOfficeChiller","R ≤ 13",0.25,0.33,0.34,9.4500000000000007E-5,2.1390000000000002E-4,2.354E-4]
[null,null,null,null,"13 < R ≤ 20",null,0.17,0.18,"",1.0750000000000001E-4,1.284E-4]
[null,null,null,null,"20 < R",null,null,0.12,"","",4.5400000000000006E-5]
[null,null,null,"TXCPSOfficeDX","R ≤ 13",0.28000000000000003,0.46,0.54,8.3000000000000012E-5,1.8660000000000001E-4,2.2360000000000001E-4]
[null,null,null,null,"13 < R ≤ 20",null,0.19,0.26,"",5.4200000000000003E-5,8.3900000000000006E-5]
[null,null,null,null,"20 < R",null,null,0.15,"","",4.35E-5]
[null,null,null,"TXCPSHotel","R ≤ 13",0.08,7.0000000000000007E-2,7.0000000000000007E-2,1.6900000000000001E-5,2.26E-5,2.5000000000000001E-5]
[null,null,null,null,"13 < R ≤ 20",null,0.06,0.05,"",1.2100000000000001E-5,1.43E-5]
[null,null,null,null,"20 < R",null,null,0.05,"","",1.0300000000000001E-5]
[null,null,null,"TXCPSWarehouse","R ≤ 13",0.05,0.09,0.16,2.9600000000000001E-5,5.13E-5,9.2100000000000016E-5]
[null,null,null,null,"13 < R ≤ 20",null,0.02,0.08,"",1.3200000000000002E-5,4.6600000000000008E-5]
[null,null,null,null,"20 < R",null,null,0.01,"","",7.9000000000000006E-6]
[null,null,null,"TXCPSOther","R ≤ 13",0.05,7.0000000000000007E-2,7.0000000000000007E-2,1.6900000000000001E-5,2.26E-5,2.5000000000000001E-5]
[null,null,null,null,"13 < R ≤ 20",null,0.02,0.05,"",1.2100000000000001E-5,1.43E-5]
[null,null,null,null,"20 < R",null,null,0.01,"","",7.9000000000000006E-6]
[]
[null,"Door Air Infiltration"]
[null,null,null,null,"Cooling Energy kWh/ft",null,null,null,"Electric Resistance Heating Energy kWh/ft",null,null,null,"Heat Pump Heating Energy kWh/ft",null,null,null,"No Heating - Summer Demand kW/ft",null,null,null,"Electric Resistance Heating Winter Demand kW/ft",null,null,null,"Heat Pump Heating Winter Demand kW/ft"]
[null,null,null,null,"1/8","1/4","1/2","3/4","1/8","1/4","1/2","3/4","1/8","1/4","1/2","3/4","1/8","1/4","1/2","3/4","1/8","1/4","1/2","3/4","1/8","1/4","1/2","3/4"]
[null,null,null,"TX1",2.23,4.5,8.94,13.43,119.13,240.28,477.32,716.53,36.1,72.81,144.63999999999999,217.13,6.1999999999999998E-3,1.24E-2,2.47E-2,3.7100000000000001E-2,3.15E-2,6.3600000000000004E-2,0.1263,0.18959999999999999,1.6199999999999999E-2,3.2599999999999997E-2,6.4699999999999994E-2,9.7100000000000006E-2]
[null,null,null,"TX2",4.59,9.27,18.41,27.63,57.53,116.26,230.76,346.4,17.43,35.229999999999997,69.930000000000007,104.97,5.1999999999999998E-3,1.06E-2,2.1100000000000001E-2,3.1600000000000003E-2,4.8500000000000001E-2,9.74E-2,0.19389999999999999,0.29110000000000003,2.0899999999999998E-2,4.2000000000000003E-2,8.3500000000000005E-2,0.12540000000000001]
[null,"Electric Resistance",null,"TX3",3.54,7.17,14.22,21.34,31.98,64.78,128.46,192.84,9.69,19.63,38.93,58.44,5.1000000000000004E-3,1.0200000000000001E-2,2.0299999999999999E-2,3.0499999999999999E-2,2.4799999999999999E-2,0.05,9.9299999999999999E-2,0.14899999999999999,1.2E-2,2.4299999999999999E-2,4.82E-2,7.2400000000000006E-2]
[null,"Heat Pump",null,"TX4",5.88,11.86,23.56,35.369999999999997,26.8,54.14,107.47,161.33000000000001,8.1199999999999992,16.399999999999999,32.57,48.89,4.7999999999999996E-3,9.7000000000000003E-3,1.9300000000000001E-2,2.8899999999999999E-2,2.24E-2,4.5100000000000001E-2,8.9599999999999999E-2,0.1346,1.0200000000000001E-2,2.06E-2,4.0899999999999999E-2,6.1499999999999999E-2]
[null,"Gas or None",null,"TX5",3.3,6.69,13.27,19.920000000000002,53.63,108.51,215.28,323.17,16.25,32.880000000000003,65.239999999999995,97.93,4.7999999999999996E-3,9.7999999999999997E-3,1.9400000000000001E-2,2.9100000000000001E-2,1.17E-2,2.3800000000000002E-2,4.7100000000000003E-2,7.0800000000000002E-2,5.7999999999999996E-3,1.17E-2,2.3199999999999998E-2,3.4799999999999998E-2]
[null,null,null,"TXCPS",3.54,7.17,14.22,21.34,31.98,64.78,128.46,192.84,9.69,19.63,38.93,58.44,5.1000000000000004E-3,1.0200000000000001E-2,2.0299999999999999E-2,3.0499999999999999E-2,2.4799999999999999E-2,0.05,9.9299999999999999E-2,0.14899999999999999,1.2E-2,2.4299999999999999E-2,4.82E-2,7.2400000000000006E-2]
[]
[null,"PC Power Management",null,null,"kWh Savings",null,"kW Savings"]
[null,null,null,"Equipment","Office","School","TX1Office","TX2Office","TX3Office","TX4Office","TX5Office","TXCPSOffice","TX1School","TX2School","TX3School","TX4School","TX5School","TXCPSSchool"]
[null,null,null,"Conventional LCD Monitor",92.1,95,0.01,0.01,0.01,0.01,1.2E-2,0.01,0.01,0.01,0.01,0.01,1.2E-2,0.01]
[null,"Used TX3 for CPS",null,"Conventional Computer",238.5,246.2,2.5999999999999999E-2,2.5000000000000001E-2,2.5999999999999999E-2,2.5000000000000001E-2,0.03,2.5999999999999999E-2,2.7E-2,2.5999999999999999E-2,2.7E-2,2.5000000000000001E-2,3.1E-2,2.7E-2]
[null,null,null,"Conventional Notebook",71.5,73.8,8.0000000000000002E-3,7.0000000000000001E-3,8.0000000000000002E-3,7.0000000000000001E-3,8.9999999999999993E-3,8.0000000000000002E-3,8.0000000000000002E-3,8.0000000000000002E-3,8.0000000000000002E-3,8.0000000000000002E-3,8.9999999999999993E-3,8.0000000000000002E-3]
[null,null,null,"ENERGY STAR Monitor",75.5,77.8,8.0000000000000002E-3,8.0000000000000002E-3,8.0000000000000002E-3,8.0000000000000002E-3,8.9999999999999993E-3,8.0000000000000002E-3,8.0000000000000002E-3,8.0000000000000002E-3,8.9999999999999993E-3,8.0000000000000002E-3,0.01,8.9999999999999993E-3]
[null,null,null,"ENERGY STAR Computer",132.5,136.9,1.4E-2,1.4E-2,1.4999999999999999E-2,1.4E-2,1.7000000000000001E-2,1.4999999999999999E-2,1.4999999999999999E-2,1.4E-2,1.4999999999999999E-2,1.4E-2,1.7000000000000001E-2,1.4999999999999999E-2]
[null,null,null,"ENERGY STAR Notebook",40.799999999999997,42.2,4.0000000000000001E-3,4.0000000000000001E-3,5.0000000000000001E-3,4.0000000000000001E-3,5.0000000000000001E-3,5.0000000000000001E-3,5.0000000000000001E-3,4.0000000000000001E-3,5.0000000000000001E-3,4.0000000000000001E-3,5.0000000000000001E-3,5.0000000000000001E-3]
[]
[null,"DHW Controls"]
[null,null,null,"Circulation Pump Savings"]
[null,null,null,null,null,null,"Summer kW Savings (Lodging only)",null,null,null,null,null,"Winter kW Savings (Lodging only)"]
[null,null,null,"Pump Size (watts)","Assumed Wattage","Annual Pump kWh Savings","TX1","TX2","TX3","TX4","TX5","TXCPS","TX1","TX2","TX3","TX4","TX5","TXCPS"]
[null,null,null,"≤ 50",50,407,4.9000000000000002E-2,4.9000000000000002E-2,4.9000000000000002E-2,4.9000000000000002E-2,4.9000000000000002E-2,4.9000000000000002E-2,6.0999999999999999E-2,5.7000000000000002E-2,6.0999999999999999E-2,6.0999999999999999E-2,5.7000000000000002E-2,6.0999999999999999E-2]
[null,"Lodging - Low Rise",null,"50 < W < 100",75,611,7.2999999999999995E-2,7.2999999999999995E-2,7.2999999999999995E-2,7.2999999999999995E-2,7.2999999999999995E-2,7.2999999999999995E-2,9.1999999999999998E-2,8.5999999999999993E-2,9.1999999999999998E-2,9.1999999999999998E-2,8.5999999999999993E-2,9.1999999999999998E-2]
[null,"Lodging - High Rise",null,"100 ≤ W < 150",125,1018,0.122,0.122,0.122,0.122,0.122,0.122,0.153,0.14299999999999999,0.153,0.153,0.14299999999999999,0.153]
[null,null,null,"≥ 150",150,1222,0.14699999999999999,0.14699999999999999,0.14699999999999999,0.14699999999999999,0.14699999999999999,0.14699999999999999,0.183,0.17100000000000001,0.183,0.183,0.17100000000000001,0.183]
[]
[]
[null,null,null,"Thermal Savings"]
[null,null,null,null,"Electric ResistanceLodging - Low RisekWh","Electric ResistanceLodging - High RisekWh","Heat PumpLodging - Low RisekWh","Heat PumpLodging - High RisekWh","Electric ResistanceLodging - Low RisekWs","Electric ResistanceLodging - High RisekWs","Heat PumpLodging - Low RisekWs","Heat PumpLodging - High RisekWs","Electric ResistanceLodging - Low RisekWw","Electric ResistanceLodging - High RisekWw","Heat PumpLodging - Low RisekWw","Heat PumpLodging - High RisekWw"]
[null,null,null,"TX1",1007,620,395,243,0.12,7.0000000000000007E-2,0.05,0.03,0.15,0.09,0.06,0.04]
[null,null,null,"TX2",566,349,222,137,7.0000000000000007E-2,0.04,0.03,0.02,0.08,0.05,0.03,0.02]
[null,null,null,"TX3",372,229,146,90,0.04,0.03,0.02,0.01,0.06,0.03,0.02,0.01]
[null,null,null,"TX4",249,153,98,60,0.03,0.02,0.01,0.01,0.04,0.02,0.01,0.01]
[null,null,null,"TX5",590,364,231,143,7.0000000000000007E-2,0.04,0.03,0.02,0.08,0.05,0.03,0.02]
[null,null,null,"TXCPS",372,229,146,90,0.04,0.03,0.02,0.01,0.06,0.03,0.02,0.01]

{"sheet":"County to Zone","index":10,"n_rows":257,"n_cols":5,"rows_kept":257,"cut":false,"hidden":true,"merged":[]}
["TX",null,null,"Selected Zone:",{"$f":"IF(Utility=\"CPS Energy\",\"CPS\",INDEX(INDIRECT(State&\"ZONE\"),MATCH(County,INDIRECT(State&\"ZONE[County]\"),0),2))","v":{"$error":"#N/A"}}]
["County","Zone"]
["Anderson",2]
["Andrews",2]
["Angelina",2]
["Aransas",4]
["Archer",2]
["Armstrong",1]
["Atascosa",3]
["Austin",3]
["Bailey",1]
["Bandera",2]
["Bastrop",3]
["Baylor",2]
["Bee",3]
["Bell",2]
["Bexar",3]
["Blanco",2]
["Borden",2]
["Bosque",2]
["Bowie",2]
["Brazoria",3]
["Brazos",3]
["Brewster",2]
["Briscoe",1]
["Brooks",4]
["Brown",2]
["Burleson",3]
["Burnet",2]
["Caldwell",3]
["Calhoun",4]
["Callahan",2]
["Cameron",4]
["Camp",2]
["Carson",1]
["Cass",2]
["Castro",1]
["Chambers",3]
["Cherokee",2]
["Childress",1]
["Clay",2]
["Cochran",1]
["Coke",2]
["Coleman",2]
["Collin",2]
["Collingsworth",1]
["Colorado",3]
["Comal",3]
["Comanche",2]
["Concho",2]
["Cooke",2]
["Coryell",2]
["Cottle",1]
["Crane",2]
["Crockett",2]
["Crosby",1]
["Culberson",2]
["Dallam",1]
["Dallas",2]
["Dawson",2]
["De Witt",3]
["Deaf Smith",1]
["Delta",2]
["Denton",2]
["Dickens",1]
["Dimmit",3]
["Donley",1]
["Duval",4]
["Eastland",2]
["Ector",2]
["Edwards",2]
["El Paso",5]
["Ellis",2]
["Erath",2]
["Falls",2]
["Fannin",2]
["Fayette",3]
["Fisher",2]
["Floyd",1]
["Foard",1]
["Fort Bend",3]
["Franklin",2]
["Freestone",2]
["Frio",3]
["Gaines",1]
["Galveston",3]
["Garza",1]
["Gillespie",2]
["Glasscock",2]
["Goliad",3]
["Gonzales",3]
["Gray",1]
["Grayson",2]
["Gregg",2]
["Grimes",3]
["Guadalupe",3]
["Hale",1]
["Hall",1]
["Hamilton",2]
["Hansford",1]
["Hardeman",1]
["Hardin",3]
["Harris",3]
["Harrison",2]
["Hartley",1]
["Haskell",2]
["Hays",2]
["Hemphill",1]
["Henderson",2]
["Hidalgo",4]
["Hill",2]
["Hockley",1]
["Hood",2]
["Hopkins",2]
["Houston",3]
["Howard",2]
["Hudspeth",5]
["Hunt",2]
["Hutchinson",1]
["Irion",2]
["Jack",2]
["Jackson",3]
["Jasper",2]
["Jeff Davis",2]
["Jefferson",3]
["Jim Hogg",4]
["Jim Wells",4]
["Johnson",2]
["Jones",2]
["Karnes",3]
["Kaufman",2]
["Kendall",2]
["Kenedy",4]
["Kent",1]
["Kerr",2]
["Kimble",2]
["King",1]
["Kinney",3]
["Kleberg",4]
["Knox",1]
["La Salle",3]
["Lamar",2]
["Lamb",1]
["Lampasas",2]
["Lavaca",3]
["Lee",3]
["Leon",2]
["Liberty",3]
["Limestone",2]
["Lipscomb",1]
["Live Oak",3]
["Llano",2]
["Loving",2]
["Lubbock",1]
["Lynn",1]
["Madison",2]
["Marion",2]
["Martin",2]
["Mason",2]
["Matagorda",3]
["Maverick",3]
["McCulloch",2]
["McLennan",2]
["McMullen",3]
["Medina",3]
["Menard",2]
["Midland",2]
["Milam",3]
["Mills",2]
["Mitchell",2]
["Montague",2]
["Montgomery",3]
["Moore",1]
["Morris",2]
["Motley",1]
["N/A"]
["Nacogdoches",2]
["Navarro",2]
["Newton",2]
["Nolan",2]
["Nueces",4]
["Ochiltree",1]
["Oldham",1]
["Orange",3]
["Palo Pinto",2]
["Panola",2]
["Parker",2]
["Parmer",1]
["Pecos",2]
["Polk",3]
["Potter",1]
["Presidio",2]
["Rains",2]
["Randall",1]
["Reagan",2]
["Real",2]
["Red River",2]
["Reeves",2]
["Refugio",4]
["Roberts",1]
["Robertson",2]
["Rockwall",2]
["Runnels",2]
["Rusk",2]
["Sabine",2]
["San Augustine",2]
["San Jacinto",3]
["San Patricio",4]
["San Saba",2]
["Schleicher",2]
["Scurry",2]
["Shackelford",2]
["Shelby",2]
["Sherman",1]
["Smith",2]
["Somervell",2]
["Starr",4]
["Stephens",2]
["Sterling",2]
["Stonewall",1]
["Sutton",2]
["Swisher",1]
["Tarrant",2]
["Taylor",2]
["Terrell",2]
["Terry",1]
["Throckmorton",2]
["Titus",2]
["Tom Green",2]
["Travis",2]
["Trinity",3]
["Tyler",3]
["Upshur",2]
["Upton",2]
["Uvalde",3]
["Val Verde",3]
["Van Zandt",2]
["Victoria",3]
["Walker",3]
["Waller",3]
["Ward",2]
["Washington",3]
["Webb",4]
["Wharton",3]
["Wheeler",1]
["Wichita",2]
["Wilbarger",1]
["Willacy",4]
["Williamson",2]
["Wilson",3]
["Winkler",2]
["Wise",2]
["Wood",2]
["Yoakum",1]
["Young",2]
["Zapata",4]
["Zavala",3]

{"sheet":"Utility Admin","index":11,"n_rows":53,"n_cols":61,"rows_kept":53,"cut":false,"hidden":true,"merged":[[2,6,3,6],[2,18,2,22],[2,23,2,25],[2,1,3,1],[2,2,3,2],[2,3,3,3],[2,4,3,4],[2,5,3,5],[2,13,3,13],[2,14,3,14],[2,15,3,15],[2,7,3,7],[2,8,3,8],[2,9,3,9],[2,10,3,10],[2,11,3,11],[2,56,2,60],[2,41,2,45],[2,48,2,52],[2,53,2,55],[2,26,2,30],[2,33,2,37],[2,38,2,40],[2,12,3,12]]}
[null,null,null,null,null,null,null,null,null,null,null,null,null,null,null,null,"$/NCPkW","$/NCPkW","$/NCPkW","$/NCPkW","$/NCPkW","$/NCPkW","$/NCPkW","$/NCPkW","$/NCPkW","$/NCPkW","$/NCPkW","$/NCPkW","$/NCPkW","$/NCPkW","$/NCPkW","$/kW","$/kW","$/kW","$/kW","$/kW","$/kW","$/kW","$/kW","$/kW","$/kW","$/kW","$/kW","$/kW","$/kW","$/kW","$/kWh","$/kWh","$/kWh","$/kWh","$/kWh","$/kWh","$/kWh","$/kWh","$/kWh","$/kWh","$/kWh","$/kWh","$/kWh","$/kWh","$/kWh"]
[null,{"$f":"'Project Info'!D9","v":"TX"},{"$f":"'Project Info'!I9","v":0},{"$f":"B2&C2","v":"TX0"},{"$f":"'Project Info'!I10","v":0},{"$f":"D2&E2","v":"TX00"},{"$f":"IF('Project Info'!$I$9=\"\",0,INDEX(G5:G21,MATCH($F2,$F$5:$F$21,0),1))","v":0},{"$f":"IF('Project Info'!$I$9=\"\",0,INDEX(H5:H21,MATCH($F2,$F$5:$F$21,0),1))","v":0},{"$f":"IF('Project Info'!$I$9=\"\",0,IF(INDEX(I5:I21,MATCH($F2,$F$5:$F$21,0),1)=0,999999,INDEX(I5:I21,MATCH($F2,$F$5:$F$21,0),1)))","v":0},{"$f":"IF('Project Info'!$I$9=\"\",0,INDEX(J5:J21,MATCH($F2,$F$5:$F$21,0),1))","v":0},{"$f":"IF('Project Info'!$I$9=\"\",0,INDEX(K5:K21,MATCH($F2,$F$5:$F$21,0),1))","v":0},{"$f":"IF('Project Info'!$I$9=\"\",0,INDEX(L5:L21,MATCH($F2,$F$5:$F$21,0),1))","v":0},{"$f":"IF('Project Info'!$I$9=\"\",0,INDEX(M5:M21,MATCH($F2,$F$5:$F$21,0),1))","v":0},{"$f":"IF('Project Info'!$I$9=\"\",0,INDEX(N5:N21,MATCH($F2,$F$5:$F$21,0),1))","v":0},{"$f":"IF('Project Info'!$I$9=\"\",0,INDEX(O5:O21,MATCH($F2,$F$5:$F$21,0),1))","v":0},{"$f":"IF('Project Info'!$I$9=\"\",0,INDEX(P5:P21,MATCH($C2,$C$5:$C$21,0),1))","v":0},{"$f":"IF($C$2=\"\",0,INDEX(Q5:Q21,MATCH($F2,$F$5:$F$21,0),1))","v":{"$error":"#N/A"}},{"$error":"#N/A"},{"$error":"#N/A"},{"$error":"#N/A"},{"$error":"#N/A"},{"$error":"#N/A"},{"$error":"#N/A"},{"$error":"#N/A"},{"$error":"#N/A"},{"$error":"#N/A"},{"$error":"#N/A"},{"$error":"#N/A"},{"$error":"#N/A"},{"$error":"#N/A"},{"$error":"#N/A"},{"$error":"#N/A"},{"$error":"#N/A"},{"$error":"#N/A"},{"$error":"#N/A"},{"$error":"#N/A"},{"$error":"#N/A"},{"$error":"#N/A"},{"$error":"#N/A"},{"$error":"#N/A"},{"$error":"#N/A"},{"$error":"#N/A"},{"$error":"#N/A"},{"$error":"#N/A"},{"$error":"#N/A"},{"$error":"#N/A"},{"$error":"#N/A"},{"$error":"#N/A"},{"$error":"#N/A"},{"$error":"#N/A"},{"$error":"#N/A"},{"$error":"#N/A"},{"$error":"#N/A"},{"$error":"#N/A"},{"$error":"#N/A"},{"$error":"#N/A"},{"$error":"#N/A"},{"$error":"#N/A"},{"$error":"#N/A"},{"$error":"#N/A"},{"$error":"#N/A"}]
[null,"State","Utility","StateUtility","Program","StateUtilityProgram","Max base","Max %","Max incentive","TRM","Load Factor","Discount","Escalation","AC kW","AC kWh","Abbreviated for Name Mgr",null,null,"HVAC",null,null,null,null,"Motors",null,null,"Miscellaneous",null,null,null,null,null,null,"HVAC",null,null,null,null,"Motors",null,null,"Miscellaneous",null,null,null,null,null,null,"HVAC",null,null,null,null,"Motors",null,null,"Miscellaneous"]
[null,null,null,null,null,null,null,null,null,null,null,null,null,null,null,null,"Refrigeration","Food Service","Variable Frequency Drives (VFD's)","Condenser Air Evaporative Pre-Cooling","Lodging Occupancy Controls","Commercial Smart Thermostats","High-Volume Low-Speed (HVLS) Fans","EnergyStar Commercial Pool Pumps","Premium Efficiency Motors","Pump Off Controller","Window Film Treatment","EnergyStar Roofing","Entrance & Exit Door Air Infiltration","PC Power Management","Central DHW Controls","Refrigeration","Food Service","Variable Frequency Drives (VFD's)","Condenser Air Evaporative Pre-Cooling","Lodging Occupancy Controls","Commercial Smart Thermostats","High-Volume Low-Speed (HVLS) Fans","EnergyStar Commercial Pool Pumps","Premium Efficiency Motors","Pump Off Controller","Window Film Treatment","EnergyStar Roofing","Entrance & Exit Door Air Infiltration","PC Power Management","Central DHW Controls","Refrigeration","Food Service","Variable Frequency Drives (VFD's)","Condenser Air Evaporative Pre-Cooling","Lodging Occupancy Controls","Commercial Smart Thermostats","High-Volume Low-Speed (HVLS) Fans","EnergyStar Commercial Pool Pumps","Premium Efficiency Motors","Pump Off Controller","Window Film Treatment","EnergyStar Roofing","Entrance & Exit Door Air Infiltration","PC Power Management","Central DHW Controls"]
[null,"TX","AEP SWEPCO",{"$f":"B5&C5","v":"TXAEP SWEPCO"},"Commercial Solutions",{"$f":"D5&E5","v":"TXAEP SWEPCOCommercial Solutions"},null,null,{"$f":"IF('Project Info'!$D$18=\"\",'Utility Admin'!G5,MIN(H5*'Project Info'!$D$18,G5))","v":0},"TX","No",0.02,7.1800000000000003E-2,80,0.11360000000000001,"SWEPCOTX",null,null,null,null,null,null,null,null,null,null,null,null,null,null,null,250,250,250,250,250,250,250,250,250,250,250,250,250,250,250,0,0,0,0,0,0,0,0,0,0,0,0,0,0,0]
[null,"TX","AEP SWEPCO","TXAEP SWEPCO","SCORE","TXAEP SWEPCOSCORE",null,null,{"$f":"IF('Project Info'!$D$18=\"\",'Utility Admin'!G6,MIN(H6*'Project Info'!$D$18,G6))","v":0},"TX","No",0.02,7.1800000000000003E-2,80,0.11360000000000001,"SWEPCOTX",null,null,null,null,null,null,null,null,null,null,null,null,null,null,null,250,250,250,250,250,250,250,250,250,250,250,250,250,250,250,0,0,0,0,0,0,0,0,0,0,0,0,0,0,0]
[null,"TX","AEP TCD",{"$f":"B7&C7","v":"TXAEP TCD"},"Commercial Solutions","TXAEP TCDCommercial Solutions",null,null,{"$f":"IF('Project Info'!$D$18=\"\",'Utility Admin'!G7,MIN(H7*'Project Info'!$D$18,G7))","v":0},"TX","No",0.02,7.4992000000000003E-2,80,0.11360000000000001,"TCC",null,null,null,null,null,null,null,null,null,null,null,null,null,null,null,150,150,150,150,150,150,150,150,150,150,150,150,150,150,150,0,0,0,0,0,0,0,0,0,0,0,0,0,0,0]
[null,"TX","AEP TCD","TXAEP TCD","SCORE/CitySmart","TXAEP TCDSCORE/CitySmart",null,null,{"$f":"IF('Project Info'!$D$18=\"\",'Utility Admin'!G8,MIN(H8*'Project Info'!$D$18,G8))","v":0},"TX","No",0.02,7.4992000000000003E-2,80,0.11360000000000001,"TCC",null,null,null,null,null,null,null,null,null,null,null,null,null,null,null,150,150,150,150,150,150,150,150,150,150,150,150,150,150,150,0,0,0,0,0,0,0,0,0,0,0,0,0,0,0]
[null,"TX","AEP TND","TXAEP TND","Commercial Solutions","TXAEP TNDCommercial Solutions",null,null,{"$f":"IF('Project Info'!$D$18=\"\",'Utility Admin'!G9,MIN(H9*'Project Info'!$D$18,G9))","v":0},"TX","No",0.02,7.4579999999999994E-2,80,0.11360000000000001,"TNC",null,null,null,null,null,null,null,null,null,null,null,null,null,null,null,0,0,0,0,0,0,0,0,0,0,0,0,0,0,0,0.05,0.04,0.05,0.04,0.04,0.04,0.04,0.04,0.04,0.04,0.04,0.04,0.04,0.04,0.04]
[null,"TX","AEP TND","TXAEP TND","SCORE/CitySmart","TXAEP TNDSCORE/CitySmart",null,null,{"$f":"IF('Project Info'!$D$18=\"\",'Utility Admin'!G10,MIN(H10*'Project Info'!$D$18,G10))","v":0},"TX","No",0.02,7.4579999999999994E-2,80,0.11360000000000001,"TNC",null,null,null,null,null,null,null,null,null,null,null,null,null,null,null,0,0,0,0,0,0,0,0,0,0,0,0,0,0,0,0.05,0.04,0.05,0.04,0.04,0.04,0.04,0.04,0.04,0.04,0.04,0.04,0.04,0.04,0.04]
[null,"TX","CenterPoint Energy","TXCenterPoint Energy","SCORE/CitySmart","TXCenterPoint EnergySCORE/CitySmart",null,null,{"$f":"IF('Project Info'!$D$18=\"\",'Utility Admin'!G11,MIN(H11*'Project Info'!$D$18,G11))","v":0},"TX",5256,0.02,8.2100000000000006E-2,80,0.11360000000000001,"CNP",null,null,null,null,null,null,null,null,null,null,null,null,null,null,null,220,220,200,180,180,200,180,180,180,180,180,240,180,180,180,0.06,0.06,0.06,0.06,0.06,0.06,0.06,0.06,0.06,0.06,0.06,0.09,0.06,0.06,0.06]
[null,"TX","CPS Energy","TXCPS Energy","Large C&I","TXCPS EnergyLarge C&I",999999,0.75,{"$f":"IF('Project Info'!$D$18=\"\",'Utility Admin'!G12,MIN(H12*'Project Info'!$D$18,G12))","v":999999},"CPS","No",0.02,6.6000000000000003E-2,81.569999999999993,4.5199999999999997E-2,"CPS",200,200,350,350,350,350,200,200,200,200,200,200,200,200,200,0,0,0,0,0,0,0,0,0,0,0,0,0,0,0,0.03,0.05,0.05,0.05,0.05,0.05,0.05,0.05,0.05,0.05,0.03,0.03,0.03,0.05,0.05]
[null,"TX","CPS Energy","TXCPS Energy","Schools & Inst","TXCPS EnergySchools & Inst",999999,0.75,{"$f":"IF('Project Info'!$D$18=\"\",'Utility Admin'!G13,MIN(H13*'Project Info'!$D$18,G13))","v":999999},"CPS","No",0.02,6.6000000000000003E-2,81.569999999999993,4.5199999999999997E-2,"CPS",200,200,350,350,350,350,200,200,200,200,200,200,200,200,200,0,0,0,0,0,0,0,0,0,0,0,0,0,0,0,0.03,0.05,0.05,0.05,0.05,0.05,0.05,0.05,0.05,0.05,0.03,0.03,0.03,0.05,0.05]
[null,"TX","CPS Energy",{"$f":"B14&C14","v":"TXCPS Energy"},"Small Business","TXCPS EnergySmall Business",999999,0.8,{"$f":"IF('Project Info'!$D$18=\"\",'Utility Admin'!G14,MIN(H14*'Project Info'!$D$18,G14))","v":999999},"CPS","No",0.02,6.6000000000000003E-2,81.569999999999993,4.5199999999999997E-2,"CPS",550,550,550,550,550,550,550,550,550,550,550,550,550,550,550,0,0,0,0,0,0,0,0,0,0,0,0,0,0,0,0,0,0,0,0,0,0,0,0,0,0,0,0,0,0]
[null,"TX","El Paso Electric TX","TXEl Paso Electric TX","Large Commercial Solutions","TXEl Paso Electric TXLarge Commercial Solutions",null,null,{"$f":"IF('Project Info'!$D$18=\"\",'Utility Admin'!G15,MIN(H15*'Project Info'!$D$18,G15))","v":0},"TX","No",0.02,7.0250000000000007E-2,80,0.11360000000000001,"EPETX",null,null,null,null,null,null,null,null,null,null,null,null,null,null,null,240,240,240,240,240,240,240,240,240,240,240,240,240,240,240,0,0,0,0,0,0,0,0,0,0,0,0,0,0,0]
[null,"TX","El Paso Electric TX","TXEl Paso Electric TX","SCORE","TXEl Paso Electric TXSCORE",null,null,{"$f":"IF('Project Info'!$D$18=\"\",'Utility Admin'!G16,MIN(H16*'Project Info'!$D$18,G16))","v":0},"TX","No",0.02,7.0250000000000007E-2,80,0.11360000000000001,"EPETX",null,null,null,null,null,null,null,null,null,null,null,null,null,null,null,240,240,240,240,240,240,240,240,240,240,240,240,240,240,240,0,0,0,0,0,0,0,0,0,0,0,0,0,0,0]
[null,"TX","El Paso Electric TX","TXEl Paso Electric TX","Small Commercial Solutions","TXEl Paso Electric TXSmall Commercial Solutions",null,null,{"$f":"IF('Project Info'!$D$18=\"\",'Utility Admin'!G17,MIN(H17*'Project Info'!$D$18,G17))","v":0},"TX","No",0.02,7.0250000000000007E-2,80,0.11360000000000001,"EPETX",null,null,null,null,null,null,null,null,null,null,null,null,null,null,null,400,400,400,400,400,400,400,400,400,400,400,400,400,400,400,0,0,0,0,0,0,0,0,0,0,0,0,0,0,0]
[null,"TX","Entergy TX","TXEntergy TX","Commercial Solutions","TXEntergy TXCommercial Solutions",null,null,{"$f":"IF('Project Info'!$D$18=\"\",'Utility Admin'!G18,MIN(H18*'Project Info'!$D$18,G18))","v":0},"TX","No",0.02,7.7252799999999996E-2,80,0.11360000000000001,"ETI",null,null,null,null,null,null,null,null,null,null,null,null,null,null,null,275,165,165,165,165,165,165,165,165,165,165,165,165,165,165,0.02,0.02,0.02,0.02,0.02,0.02,0.02,0.02,0.02,0.02,0.02,0.02,0.02,0.02,0.02]
[null,"TX","Texas-New Mexico Power","TXTexas-New Mexico Power","Commercial Solutions","TXTexas-New Mexico PowerCommercial Solutions",null,null,{"$f":"IF('Project Info'!$D$18=\"\",'Utility Admin'!G19,MIN(H19*'Project Info'!$D$18,G19))","v":0},"TX",5256,0.02,7.8899999999999998E-2,80,0.11360000000000001,"TNMP",null,null,null,null,null,null,null,null,null,null,null,null,null,null,null,150,150,100,150,150,150,150,150,150,150,150,150,150,150,150,0.03,0.03,0.02,0.03,0.03,0.03,0.03,0.03,0.03,0.03,0.03,0.04,0.03,0.03,0.03]
[null,"TX","Texas-New Mexico Power","TXTexas-New Mexico Power","SCORE/CitySmart","TXTexas-New Mexico PowerSCORE/CitySmart",null,null,{"$f":"IF('Project Info'!$D$18=\"\",'Utility Admin'!G20,MIN(H20*'Project Info'!$D$18,G20))","v":0},"TX",5256,0.02,7.8899999999999998E-2,80,0.11360000000000001,"TNMP",null,null,null,null,null,null,null,null,null,null,null,null,null,null,null,150,150,150,150,150,150,150,150,150,150,150,150,150,150,150,0.03,0.03,0.03,0.03,0.03,0.03,0.03,0.03,0.03,0.03,0.03,0.04,0.03,0.03,0.03]
[null,"TX","Texas-New Mexico Power","TXTexas-New Mexico Power","SCORE Underserved/Small Score","TXTexas-New Mexico PowerSCORE Underserved/Small Score",null,null,{"$f":"IF('Project Info'!$D$18=\"\",'Utility Admin'!G21,MIN(H21*'Project Info'!$D$18,G21))","v":0},"TX",5256,0.02,7.8899999999999998E-2,80,0.11360000000000001,"TNMP",null,null,null,null,null,null,null,null,null,null,null,null,null,null,null,250,250,250,250,250,250,250,250,250,250,250,250,250,250,250,0.03,0.03,0.03,0.03,0.03,0.03,0.03,0.03,0.03,0.03,0.03,0.04,0.03,0.03,0.03]
[]
[null,"TX"]
[null,"AEP SWEPCO"]
[null,"AEP TCD"]
[null,"AEP TND"]
[null,"CenterPoint Energy"]
[null,"CPS Energy"]
[null,"El Paso Electric TX"]
[null,"Entergy TX"]
[null,"Texas-New Mexico Power"]
[]
[]
[]
[]
[]
[]
[]
[]
[]
[]
[]
[]
[]
[]
[]
[]
[]
[]
["(this should be row 50)",null,"PPI:"]
[null,"Account #:"]
[null,"Name on Account or Tax ID:"]
[null,"PPI Hide Trigger:",true]

{"sheet":"Version Log","index":12,"n_rows":110,"n_cols":7,"rows_kept":110,"cut":false,"hidden":true,"merged":[[1,1,1,5],[3,5,3,6],[4,2,4,3],[4,5,4,6]]}
[]
[null,"Version Log"]
[]
[null,"Original Author:","A. Boone Drummond / A Keeling",null,"QA/QC Engineer(s):","A. Boone Drummond"]
[null,"Primary Developer:","Adam Groenhuyzen",null,"Senior Engineer Approval:"]
[]
[null,"Program Year","Version","Date","Reason for Change","Change Description","Contact, Department"]
[null,2016,null,"2015-11-16","High Efficiency Electric Convection Oven","TRM v3.1 Deemed Table and calculator interface","A Boone Drummond"]
[null,2016,null,"2015-11-16","High Efficiency Electric Combination Oven","TRM v3.1 Deemed Table and calculator interface","A Boone Drummond"]
[null,2016,null,"2015-11-16","ENERGY STAR Commercial Dishwashers","TRM v3.1 Deemed Table and calculator interface","A Boone Drummond"]
[null,2016,null,"2015-11-16","ENERGY STAR Electric Steam Cookers","TRM v3.1 Deemed Table and calculator interface","A Boone Drummond"]
[null,2016,null,"2015-11-16","ENERGY STAR Commercial Electric Hot Food Holding Cabinet","TRM v3.1 Deemed Table and calculator interface","A Boone Drummond"]
[null,2016,null,"2015-11-16","ENERGY STAR Electric Fryer","TRM v3.1 Deemed Table and calculator interface","A Boone Drummond"]
[null,2016,null,"2015-11-16","Guestroom, Dormitory and Multifamily Occupancy Control (NC & Retro)","TRM v3.1 Deemed Table, removed Multi Family, and calculator interface","A Boone Drummond"]
[null,2016,null,"2015-11-16","Variable Frequency Drive (VFD) on Air Handler Unit (AHU) Supply Fan","TRM v3.1 Deemed Table and calculator interface","A Boone Drummond"]
[null,2016,null,"2015-11-23","Lodging Occupancy Sensor Controls","Changed name","Adam Keeling"]
[null,2016,null,"2015-11-23","Lodging Occupancy Sensor Controls","Simplified sheet","Adam Keeling"]
[null,2016,null,"2015-11-23","Lodging Occupancy Sensor Controls","Changed lookups to index/match","Adam Keeling"]
[null,2016,null,"2015-11-23","Combination Oven","Changed from \"high efficiency\" to \"ENERGY STAR\"","Adam Keeling"]
[null,2016,null,"2015-11-23","Food Service","Removed building type selection","Adam Keeling"]
[null,2016,null,"2015-11-23","Dishwasher","Changed lookups to index/match","Adam Keeling"]
[null,2016,null,"2015-11-23","Fryers","Fixed savings to multiply by quantity","Adam Keeling"]
[null,2016,null,"2015-11-23","Holding cabinet","Fixed savings to multiply by quantity","Adam Keeling"]
[null,2016,null,"2015-11-23","Holding cabinet","Changed formulas to lookups","Adam Keeling"]
[null,2016,null,"2015-11-23","Food Service","Simplified sheet","Adam Keeling"]
[null,{"$f":"IF(D26=\"\",\"\",YEAR(D26))","v":""},null,null,"VFD","Simplified sheet"]
[null,2017,null,"2016-11-09","VFD on AHU","Added CPS compatability","Adam Groenhuyzen"]
[null,2017,null,"2016-11-10","ECM on Evaporator Fan","Updated measure for TRM4 methodology","Adam Groenhuyzen"]
[null,2017,null,"2016-11-10","workbook","added Macros to reconfigure workbook for CPS & NCP kW","Adam Groenhuyzen"]
[null,2017,null,"2016-11-10","Pre Rinse Spray Valves","Added CPS compatability","Adam Groenhuyzen"]
[null,2017,null,"2016-11-10","General Formatting","Improved overall formatting/color schemes","Adam Groenhuyzen"]
[null,2017,null,"2016-11-11","Refrigeration measures","Updated all remaining measures to TRM 4.0 and added CPS compatibility","Adam Groenhuyzen"]
[null,2017,null,"2016-11-15","Window Film, POC","added measures","Adam Groenhuyzen"]
[null,2017,null,"2016-11-28",null,"Remove EUL summary","Adam Keeling"]
[null,2017,null,null,null,"Replaced zone input on each sheet with county input on ProjectInfo"]
[null,2017,null,null,null,"Replaced \"kW\" with \"Peak kW\""]
[null,2017,null,null,null,"added more rows to ensure each measure has at least 3"]
[null,2017,null,null,null,"added Utility and Program inputs"]
[null,2017,null,null,"ECM on Evaporator Fan","Split input of Walk-in vs Case and refrigeration temp"]
[null,2017,null,null,null,"changed all refrigerator types to temps for consistency"]
[null,2017,null,null,null,"formatting clean up"]
[null,2017,null,null,"Reach-ins","added quantity"]
[null,2017,null,null,"Zero energy doors","fixed lookups"]
[null,2017,null,null,"Electronic Defrost Controls","updated kW/ton values"]
[null,2017,null,null,"Vending machine controls","removed CF for CPS"]
[null,2017,null,null,null,"increased decimal places to 3 for all kW"]
[null,2017,null,null,"all food service except PRSV","set NCP=CP kW since not in guidebook"]
[null,2017,null,null,"convection oven","fixed lookups"]
[null,2017,null,null,"Combination Oven","fixed lookups"]
[null,2017,null,null,"Fryers","fixed lookups"]
[null,2017,null,null,"Dishwasher","added type definitions from TRM"]
[null,2017,null,null,"window treatment","made CPS same as Zone 3"]
[null,2017,null,null,"Lodging Occupancy Sensor Controls","made CPS same as Zone 3"]
[null,2017,null,null,null,"changed button macros to be automatic based on Utility selection"]
[null,2017,null,null,null,"alphabetized order of refrigeration measures"]
[null,2017,null,null,null,"added CPS small business"]
[null,2017,null,null,"door gaskets","added for CPS only"]
[null,2017,null,null,null,"added incentives for all"]
[null,2017,null,null,"gaskets","changed to height, width entry"]
[null,2017,null,null,"ECM on Evaporator Fan","added existing motor type"]
[null,2017,null,null,"aerators","added for CPS only"]
[null,2017,null,null,"showerheads","added for CPS only"]
[null,2017,null,null,"window treatment","changed post shading type to post shading coefficient"]
[null,2017,null,"2016-12-16",null,"removed some unnecessary data validation in unused cells"]
[null,2017,null,null,null,"added iferror statements to incentive fields"]
[null,2017,null,null,null,"fixed some lost data validation"]
[null,2017,null,null,null,"Auto-populate county to Bexar if CPS"]
[null,2017,null,null,null,"separated project info into required and optional"]
[null,2017,null,null,null,"moved county and project cost up to required section"]
[null,2017,null,"2017-03-16","utility admin","updated entergytx refrig incentive","Adam Groenhuyzen"]
[null,2017,null,null,null,"fixed incentive cap calc to not be $0 when utility doesn't have a cap"]
[null,2017,null,"2017-04-05","utility admin","corrected CPS incentives for HVAC controls"]
[null,2017,null,"2017-05-10","Food Service","incorporated LA/MS & CPS 2017 Guidebook changes"]
[null,2017,"V17.1.2","2017-05-10","workbook","added macros to show/hide measure tabs, and macros to show/hide individual measures on refrigeration & commercial kitchen"]
[null,2017,null,null,"Refrigeration measures","added load factor for TNMP"]
[null,2017,null,null,"Lodging Occupancy Sensor Controls","Added load factor, updated for CPS 2017 Guidebook"]
[null,2017,null,null,"VFD on AHU","Added LA/MS, load factor"]
[null,2018,null,"2017-10-05","Evap Pre-Cool & Pool Pump","Added measures as per TX TRM 5"]
[null,2018,null,"2017-10-16","Refrigeration measures, Commercial Kitchen","Added LA/MS. Configured multiple measures which require different inputs to show/hide necessary input fields as per selected TRM."]
[null,2018,null,null,"workbook","various bug fixes"]
[null,2018,"V18.0.0","2017-10-17","VFD on AHU","Added CV systems for CPS & updated savings tables for Nov 2017 Guidebook"]
[null,2018,null,"2017-11-20","Savings Summary","Added kWh-weighted capped incentive column"]
[null,2018,null,null,"VFD on AHU","Updated TX tables for TRM 5"]
[null,2018,null,null,"workbook","changed Load Factor from being applied at every measure to only be applied on Savings Summary sheet"]
[null,2018,null,null,"Updated for next program year",null,"Adam Groenhuyzen"]
[null,2018,null,"2018-01-08","QA/QC",null,"A Boone Drummond"]
[null,2018,null,"2018-01-09","Lookup tables","updated values. ","Adam Groenhuyzen"]
[null,2018,null,"2018-01-11","workbook","updates & bug fixes","Adam Groenhuyzen"]
[null,2018,null,"2018-01-16","utility admin","updated TX incentive rates. Locked tool to TX only for now.","Adam Groenhuyzen"]
[null,2018,null,"2018-01-17","utility admin","updated TX load factor for CNP & ETI","Adam Groenhuyzen"]
[null,2018,"v18.0.1","2018-01-30","foodservice","changed incentives for pre-rinse spray valves, low flow showerheads, and low flow faucets to be savings based.","Adam Groenhuyzen"]
[null,2018,"v18.0.2","2018-07-20","Summary","Corrected how load factor is applied, removed incentives from measure sheets.","Adam Groenhuyzen"]
[null,2018,"v18.1.0","2018-08-24","Project Info","Added Hide/Restore PPI macros","Adam Groenhuyzen"]
[null,2018,"v19.0.0","2018-10-01","Roofing","Added EnergyStar Roofing measure for TX TRM 6","Adam Groenhuyzen"]
[null,2019,null,null,"workbook","Re-formatted all single-measure tabs to use same heading color, was running out of different heading colors","Adam Groenhuyzen"]
[null,2019,null,null,"Door Gaskets","added compatibility for TX TRM 6","Adam Groenhuyzen"]
[null,2019,null,null,"Door infiltration","Added new measure for TX TRM 6","Adam Groenhuyzen"]
[null,2019,null,"2018-10-02","Macros","re-worked show/hide macros to simplify and condense code","Adam Groenhuyzen"]
[null,2019,null,null,"Summary","Re-vamped worksheet","Adam Groenhuyzen"]
[null,2019,null,null,"Project Info","Added title heading","Adam Groenhuyzen"]
[null,2019,null,null,"Smart Thermostats","Added new measure for TX TRM 6","Adam Groenhuyzen"]
[null,2019,"19.0.1","2019-01-24","Roofing","Updated lookup values & added eligibility check","Adam Groenhuyzen"]
[null,2019,"19.0.2","2019-04-26","utility admin","Removed Load Factor for ETI","Adam Groenhuyzen"]
[null,2020,"20.0.0",null,"utility admin","Removed LA/MS/OK/AR","Adam Groenhuyzen"]
[null,null,null,null,"Food Service","Added Kitchen DCV, Commercial Ice Maker","Adam Groenhuyzen"]
[null,null,null,null,"HVAC","Consolidated HVAC measures, added HVLS fans","Adam Groenhuyzen"]
[null,null,null,null,"Motors","Consolidated motor measures, added premium eff motors","Adam Groenhuyzen"]
[null,null,null,null,"Misc","Consolidated misc measures, added PC power management & DHW Control","Adam Groenhuyzen"]
[null,null,null,"2019-12-02","QA/QC","QA/QC","Boone Drummond"]
[null,null,null,"2020-01-08","utility admin","Updated program incentives for 2020","Adam Groenhuyzen"]